program: Gaussian 09
title: 000142628
version: EM64L-G09RevD.01
frameworkgroup: C1[X(C10H20N2)]
method: RPBEPBE
basis: SDD
operation: Freq
keyword: #pfreq=noraman
keyword: PBEPBE/SDD
title: #p freq=noraman PBEPBE/SDD
converged: YES YES NO NO
title: Mulliken charges:
elementType: N N C C C C C C C C C C H H H H H H H H H H H H H H H H H H H H
charge: -0.130306 -0.074899 -0.156480 -0.216535 -0.513838 -0.465147 -0.447080 0.336936 -0.630758 -0.710591 -0.746014 -0.727924 0.240226 0.261296 0.265015 0.214596 0.213458 0.232309 0.222914 0.218857 0.243628 0.214641 0.208527 0.232363 0.205319 0.204090 0.236549 0.218324 0.201233 0.208882 0.206021 0.234386
chargesum: 0.00000
title: Mulliken charges with hydrogens summed into heavy atoms:
elementType: N N C C C C C C C C C C
charge: -0.130306 -0.074899 0.083746 0.044761 -0.034227 -0.019380 -0.005309 0.336936 0.036039 -0.068819 -0.089907 -0.078636
polarizability: 1.33765961e+02 -7.08425312e-01 1.15162188e+02 -3.78302463e-01 -3.96062825e-01 1.04416234e+02
1716.lowfreq: -14.4870 -3.7074 -0.0006 -0.0006 -0.0004 22.9266 60.2920 110.8911 163.7501
frequency: 60.1740 110.8518 163.6499 190.3241 209.2169 231.6899 278.5268 294.7554 305.8763 316.9787 322.2665 339.0550 367.9968 396.9630 443.3887 449.2809 494.5498 500.5513 583.9468 641.9302 711.0085 750.4969 781.7099 802.4276 820.2635 863.5738 887.4539 896.8943 902.7942 922.9050 936.6205 940.4386 958.0178 983.4242 993.9782 1017.8821 1034.3885 1037.7864 1051.1207 1070.8178 1113.8174 1126.0180 1135.7428 1166.9003 1190.0719 1194.7661 1209.9187 1221.3069 1230.2713 1250.3305 1256.4319 1269.3951 1288.4151 1293.1993 1300.1214 1357.8683 1363.5671 1387.6256 1414.6293 1445.5472 1452.0552 1454.0720 1457.3306 1466.1421 1471.9928 1475.8355 1480.5004 1485.1228 1502.5701 1511.9068 2937.3141 2972.2475 2977.6648 2983.2262 3000.2962 3014.3510 3038.9167 3041.3679 3061.8916 3066.5001 3069.1894 3072.6791 3079.2881 3083.4844 3089.0179 3089.9930 3094.3565 3097.8047 3100.0785 3139.0947
redmass: 2.6924 2.8139 1.1136 1.5422 2.2500 1.6959 2.2522 1.2730 2.2089 2.2696 1.2886 1.4887 2.3119 2.3632 2.5201 2.2074 2.5583 2.8604 3.4113 4.6994 4.6133 4.0663 3.0133 1.4779 3.0278 2.4103 2.3968 2.4677 1.7195 1.6849 1.7503 1.4052 2.0541 2.1015 1.8411 1.4160 1.7789 1.5396 1.6742 2.0175 1.4043 1.3624 1.3398 2.2960 1.7435 1.9132 2.4492 1.2115 2.8583 3.0069 1.4032 1.5223 1.6251 1.5422 1.4427 1.2208 1.2141 1.2094 1.1505 1.0546 1.0624 1.0811 1.0750 1.0578 1.0793 1.0537 1.0566 1.0659 1.0525 1.0576 1.0439 1.0346 1.0348 1.0352 1.0623 1.0642 1.0654 1.0888 1.0994 1.0993 1.0981 1.0903 1.0993 1.1007 1.1000 1.1015 1.1000 1.0969 1.0910 1.0995
irintensity: 0.0724 0.5521 0.2375 2.3019 1.1920 0.4891 0.2781 0.2323 0.1905 0.4431 0.7981 1.2695 2.9784 0.2549 1.9335 4.2633 0.4925 2.9926 1.5943 6.1018 6.7363 2.3515 1.4740 3.3129 1.3684 9.8381 4.0095 7.4421 0.3370 2.6913 1.6553 0.8325 5.6434 17.7967 3.8542 0.6237 2.6149 2.5495 11.8384 7.4689 0.2408 4.3203 19.3759 11.9376 2.8844 7.2187 61.7093 0.3847 26.0196 6.6167 4.2349 1.3987 4.7315 9.0148 1.4803 29.6273 28.0136 23.0039 3.7898 7.8289 7.0966 5.5631 6.0651 7.3970 14.8639 9.7626 10.2701 3.2201 22.6458 3.2111 81.8236 26.5464 32.7685 23.7011 31.7212 70.3584 26.1232 36.7853 15.0532 7.8483 54.3081 48.1025 49.1731 13.4807 39.2546 55.9726 29.8060 21.8035 37.5691 18.3056
temp: 298.150 k
press: 1.00000 atm
elementType: 7 7 6 6 6 6 6 6 6 6 6 6 1 1 1 1 1 1 1 1 1 1 1 1 1 1 1 1 1 1 1 1
symmnumber: 1
zpe: 753935.7 jmol-1
zpe.correction: 0.287159 hartree
zpe.thermalcorrener: 0.299593 hartree
zpe.thermalcorrenthalpy: 0.300537 hartree
zpe.thermalcorrgfe: 0.250312 hartree
zpe.sumelectzpe: -501.522385 hartree
zpe.sumelectthermal: -501.509952 hartree
zpe.sumelectthermalent: -501.509007 hartree
zpe.sumelectthermalfe: -501.559233 hartree
dipole: -0.7290 -0.5847 0.1175
dipole: 0.9419
quadrupole: -72.5106 -73.5404 -78.2155
quadrupole: -0.4128 -0.7265 -0.7660
quadrupole: 2.2449 1.2151 -3.4600 -0.4128 -0.7265 -0.7660
hfenergy: -501.8095443 hartree
pointgroup: C01 [X(C10H20N2)]
dipole: -0.2977632 -0.2095973 0.0688395 debye
polarizability: 133.668336|-1.5042776|114.9687692|0.361521|-1.812792|104.7072784 unknown
InChI: InChI=1S/C10H20N2/c1-10(2,3)12-9-6-5-8(7-9)11(12)4/h8-9H,5-7H2,1-4H3
charge 0 multiplicity 1
32 atoms
N  0.296938 -0.034017 -0.395687
N  -0.417985 1.113005 0.321807
C  -0.600258 -1.212885 -0.090585
C  -1.720397 0.503995 0.802209
C  -1.23413 -0.874385 1.296411
C  -1.834486 -1.093099 -1.034607
C  -2.646886 0.088777 -0.386928
C  1.757112 -0.172122 0.022457
C  -0.6087 2.259644 -0.601795
C  2.379612 -1.231272 -0.925684
C  2.455623 1.185503 -0.228832
C  1.993181 -0.578955 1.505062
H  -0.05566 -2.163704 -0.174259
H  -2.179377 1.169124 1.550711
H  -0.514931 -0.809498 2.123213
H  -2.065778 -1.547745 1.567147
H  -2.41621 -2.033271 -1.047292
H  -1.505212 -0.867945 -2.062419
H  -2.834215 0.916246 -1.091996
H  -3.628598 -0.244636 -0.001461
H  0.354711 2.764696 -0.771048
H  -1.294868 2.981153 -0.119829
H  -1.017591 1.969716 -1.593521
H  2.162866 -0.971039 -1.976606
H  3.475654 -1.263551 -0.785494
H  1.990797 -2.247652 -0.732377
H  2.050674 1.957566 0.447551
H  2.313122 1.509023 -1.275326
H  3.539779 1.088947 -0.035626
H  1.584334 -1.581584 1.725953
H  3.078267 -0.606711 1.719511
H  1.52621 0.159076 2.181141
