program: Gaussian 09
title: 000142624
version: EM64L-G09RevD.01
frameworkgroup: C1[X(C22H18O2S2)]
method: RPBEPBE
basis: SDD
operation: Freq
keyword: #p
keyword: freq=noraman
keyword: PBEPBE/SDD
title: #p freq=noraman PBEPBE/SDD
converged: YES YES NO NO
title: Mulliken charges:
elementType: S S O O C C C C C C C C C C C C C C C C C C C C C C H H H H H H H H H H H H H H H H H H
charge: 0.310199 0.310205 -0.165827 -0.191128 -0.731268 0.577315 0.122705 0.114662 -0.395854 -0.370751 -0.242729 -0.242679 -0.208345 -0.216583 -0.206580 -0.210405 -0.210274 -0.206520 0.448256 0.448250 -0.370774 -0.380510 -0.380338 -0.370615 -0.803789 -0.803791 0.268684 0.268354 0.233595 0.235427 0.274924 0.245620 0.245619 0.274979 0.238349 0.232947 0.232946 0.238353 0.225131 0.229720 0.238837 0.238837 0.229732 0.225114
chargesum: 0.00000
title: Mulliken charges with hydrogens summed into heavy atoms:
elementType: S S O O C C C C C C C C C C C C C C C C C C C C C C
charge: 0.310199 0.310205 -0.165827 -0.191128 -0.731268 0.577315 0.122705 0.114662 -0.127171 -0.102397 -0.242729 -0.242679 0.025250 0.018845 0.068344 0.035216 0.035345 0.068459 0.448256 0.448250 -0.132425 -0.147563 -0.147392 -0.132262 -0.110101 -0.110108
polarizability: 3.31383059e+02 -1.80541210e-03 2.36923967e+02 1.33817256e-02 6.98957322e-01 2.52389252e+02
1716.lowfreq: -29.1621 -26.7424 -5.2332 0.0001 0.0005 0.0013 6.8136 11.5287 19.6020
frequency: -29.0367 -26.5895 19.1423 19.9110 24.5303 32.8178 41.8937 45.2667 74.5382 85.2799 111.4907 132.0087 137.9020 168.3885 169.1743 224.9066 236.9845 263.3161 281.5361 291.1814 301.7450 347.7349 358.7414 359.4200 385.9135 391.6415 402.3364 409.0275 409.9817 415.3480 498.7861 507.1250 507.1401 512.3231 559.4344 595.5190 607.9658 612.4269 630.6626 630.8589 657.0396 698.7558 705.4228 713.1965 714.2820 753.0261 783.5040 786.9041 787.4852 799.8976 810.4059 825.1192 828.4169 851.6839 852.6551 894.1505 907.2076 959.4351 960.8024 968.5362 974.6958 980.5823 983.9632 987.6546 988.0161 1002.4122 1003.5299 1004.0914 1021.2539 1047.4912 1047.6616 1074.4321 1075.6311 1092.7210 1115.4947 1115.8475 1169.0036 1183.4904 1187.9086 1188.7732 1219.9795 1220.2009 1234.0184 1277.6094 1294.2454 1294.7191 1362.8243 1363.5065 1392.9341 1393.2037 1398.8678 1398.8889 1406.3627 1452.0456 1457.3446 1469.7383 1469.8426 1473.7089 1473.7384 1478.1119 1478.2395 1575.0300 1575.7610 1603.0862 1603.1142 1605.9663 1617.3370 1710.9485 2977.2537 2977.3127 3058.9227 3058.9433 3088.2602 3088.2887 3125.1295 3125.1590 3130.6812 3130.7576 3134.4422 3147.6228 3156.7925 3156.8209 3158.6896 3168.7388 3168.8295 3171.4747
redmass: 1.0173 1.0182 5.6974 5.2985 4.8012 5.5247 3.7892 4.4954 4.9814 8.0969 5.4287 4.6726 5.4846 6.3392 5.9887 5.5771 5.9088 5.5832 7.6500 5.4199 5.7807 7.1022 3.3150 2.9295 9.2818 7.8562 7.5407 2.8772 3.0812 3.3487 4.1000 2.9541 3.0722 6.9250 8.9652 9.6396 5.6868 5.8857 6.9685 6.9729 4.9769 6.9520 4.2329 3.5504 3.5203 7.4779 1.8087 4.1959 5.1404 3.2860 3.9520 1.3907 1.7279 1.2426 1.2819 1.4508 6.9387 1.3083 1.3319 1.3993 3.1626 1.3755 1.8681 1.4029 1.4443 1.3635 3.9745 4.2942 2.0427 1.5747 1.5751 2.8896 2.9041 2.1999 1.3147 1.3135 1.1134 2.2244 1.1157 1.1494 2.9934 2.9821 3.5796 1.5043 1.2804 1.2794 4.8926 4.9757 3.2755 3.2575 1.2227 1.2228 8.1274 2.5366 2.6006 1.0913 1.0914 1.0566 1.0566 2.4589 2.4573 6.1966 6.2240 6.1978 6.2077 7.7074 7.2709 12.9783 1.0389 1.0389 1.0948 1.0947 1.0999 1.0999 1.0888 1.0888 1.0898 1.0898 1.0861 1.0899 1.0957 1.0958 1.0957 1.0958 1.0958 1.1004
irintensity: 0.4753 0.5698 0.6976 1.2099 0.4506 0.0088 0.1438 1.8957 0.7065 0.3472 0.5663 0.7107 1.5331 0.2596 0.0311 0.5996 0.1028 0.0003 1.9551 3.0536 2.0611 0.8831 0.4258 1.3789 3.5633 2.1973 0.7347 0.0065 0.2812 0.7679 0.4858 22.3125 34.9800 0.4689 5.4046 2.1495 2.1133 1.1164 0.0486 0.0880 9.2509 1.5949 95.6402 2.6284 32.5293 4.3497 61.6896 4.2270 3.9142 13.0494 59.8638 24.9083 130.6548 0.5100 14.0815 3.3409 1.9870 2.6822 2.7881 0.4053 53.5066 0.0671 12.7428 0.0805 1.9918 0.6215 19.3659 5.6948 3.9000 45.2120 6.0774 0.3506 0.0183 3.2314 0.0958 17.3424 5.1039 5.2512 14.8957 0.0684 7.4152 0.9571 46.3321 3.9536 0.0136 1.9567 0.0643 0.1531 0.1749 9.3486 17.3041 9.6428 2.5131 11.8021 8.8961 2.1174 26.9295 5.8092 18.8198 55.9054 11.7881 0.0011 0.5627 8.4029 8.4876 2.3069 9.9690 294.9576 54.9396 13.5785 6.8729 29.8794 11.8652 19.6890 15.4642 13.7431 16.3207 16.0287 2.3278 5.3366 1.0325 12.9638 9.1609 0.7877 1.3692 18.5943
temp: 298.150 k
press: 1.00000 atm
elementType: 16 16 8 8 6 6 6 6 6 6 6 6 6 6 6 6 6 6 6 6 6 6 6 6 6 6 1 1 1 1 1 1 1 1 1 1 1 1 1 1 1 1 1 1
symmnumber: 1
zpe: 871075.6 jmol-1
zpe.correction: 0.331775 hartree
zpe.thermalcorrener: 0.354581 hartree
zpe.thermalcorrenthalpy: 0.355525 hartree
zpe.thermalcorrgfe: 0.276347 hartree
zpe.sumelectzpe: -1793.910117 hartree
zpe.sumelectthermal: -1793.887311 hartree
zpe.sumelectthermalent: -1793.886366 hartree
zpe.sumelectthermalfe: -1793.965545 hartree
dipole: 0.0009 4.7237 -3.3654
dipole: 5.7999
quadrupole: -136.6311 -165.7156 -160.1145
quadrupole: 0.0007 0.0026 -6.8685
quadrupole: 17.5226 -11.5618 -5.9608 0.0007 0.0026 -6.8685
hfenergy: -1794.2418917 hartree
pointgroup: C01 [X(C22H18O2S2)]
dipole: 0.0006174 -2.2478826 -0.39222 debye
polarizability: 331.3830517|0.0223045|244.0563506|-0.0163531|-7.7409328|245.2568764 unknown
InChI: InChI=1S/C22H18O2S2/c1-15-7-11-17(12-8-15)25-22(26-18-13-9-16(2)10-14-18)20-6-4-3-5-19(20)21(23)24-22/h3-14H,1-2H3
charge 0 multiplicity 1
44 atoms
S  1.495399 1.206118 2.17015
S  -1.495249 1.205607 2.170484
O  -0.000273 1.661802 -0.140581
O  -0.000524 1.37163 -2.469658
C  0.000023 0.788801 1.055537
C  0.000214 -0.614969 0.504584
C  0.000056 -0.560726 -0.905796
C  -0.000159 0.855471 -1.342403
C  0.000486 -1.850912 1.174286
C  0.000114 -1.726836 -1.696023
C  2.865985 0.756266 1.020949
C  -2.865943 0.755405 1.021551
C  0.000574 -3.02934 0.390968
C  0.000386 -2.971517 -1.02927
C  3.24475 1.643319 -0.013327
C  -3.571707 -0.454482 1.214888
C  3.571398 -0.453956 1.21351
C  -3.244438 1.641894 -0.013315
C  5.057342 0.104229 -0.673199
C  -5.057471 0.102899 -0.672201
C  4.32787 1.308374 -0.855606
C  -4.661338 -0.770949 0.374059
C  4.660936 -0.770195 0.372488
C  -4.327637 1.306717 -0.855386
C  6.247531 -0.226013 -1.556203
C  -6.247732 -0.227544 -1.55503
H  0.000618 -1.894497 2.268067
H  -0.000013 -1.656048 -2.788358
H  0.000781 -4.006588 0.886745
H  0.000457 -3.901705 -1.607364
H  2.692028 2.576685 -0.15675
H  -3.268249 -1.137906 2.014522
H  3.267715 -1.137811 2.012691
H  -2.691452 2.575015 -0.157325
H  4.609883 1.995268 -1.662306
H  -5.206953 -1.709441 0.529887
H  5.206266 -1.708956 0.527698
H  -4.609435 1.993172 -1.662538
H  6.389742 -1.316464 -1.655385
H  6.131797 0.198814 -2.568611
H  7.181663 0.189937 -1.130814
H  -7.181431 0.190834 -1.131073
H  -6.130853 0.194794 -2.568352
H  -6.391559 -1.317994 -1.651794
