program: Gaussian 09
title: 000142611
version: EM64L-G09RevD.01
frameworkgroup: C1[X(C34H24S2)]
method: RPBEPBE
basis: SDD
operation: Freq
keyword: #pfreq=noraman
keyword: PBEPBE/SDD
title: #p freq=noraman PBEPBE/SDD
converged: YES YES NO NO
title: Mulliken charges:
elementType: S S C C C C C C C C C C C C C C C C C C C C C C C C C C C C C C C C C C H H H H H H H H H H H H H H H H H H H H H H H H
charge: 0.191914 0.191913 0.345426 0.345426 -0.244516 -0.244092 -0.244518 -0.244091 -0.344843 -0.345205 -0.344843 -0.345203 0.308069 0.308082 0.308075 0.308076 -0.355522 -0.355476 -0.355481 -0.355513 -0.355585 -0.355625 -0.355628 -0.355586 -0.225732 -0.225723 -0.225714 -0.225739 -0.225759 -0.225788 -0.225777 -0.225771 -0.235832 -0.235832 -0.235832 -0.235832 0.225774 0.225626 0.225775 0.225626 0.249034 0.249037 0.249037 0.249034 0.249023 0.249020 0.249020 0.249022 0.228660 0.228659 0.228660 0.228659 0.228659 0.228658 0.228659 0.228658 0.229945 0.229944 0.229945 0.229944
chargesum: 0.00000
title: Mulliken charges with hydrogens summed into heavy atoms:
elementType: S S C C C C C C C C C C C C C C C C C C C C C C C C C C C C C C C C C C
charge: 0.191914 0.191913 0.345426 0.345426 -0.018742 -0.018466 -0.018743 -0.018465 -0.344843 -0.345205 -0.344843 -0.345203 0.308069 0.308082 0.308075 0.308076 -0.106488 -0.106440 -0.106444 -0.106479 -0.106562 -0.106606 -0.106608 -0.106564 0.002928 0.002936 0.002946 0.002920 0.002900 0.002870 0.002882 0.002887 -0.005887 -0.005888 -0.005887 -0.005888
polarizability: 6.09321305e+02 5.53766901e-04 5.44989580e+02 1.29867517e-02 3.85418666e-03 3.05727605e+02
1716.lowfreq: -53.0602 -50.1435 -45.2885 -45.2105 -0.0016 -0.0009 -0.0007 2.5009 3.5530
frequency: -53.0602 -50.1422 -45.2105 -45.1982 10.2857 24.1612 30.8986 31.0741 37.8042 38.1683 48.6089 65.5874 92.1321 95.1924 111.6925 144.1139 187.0139 191.9531 194.6781 198.6179 204.4033 254.2477 269.8002 281.2246 282.5484 290.3347 298.8821 307.0886 324.7660 398.4640 398.4770 398.6073 398.6132 438.9615 463.9724 494.8821 512.7751 523.2790 524.2133 533.1804 534.8047 542.2015 551.0340 581.1132 584.1004 591.6305 609.8529 618.7161 619.1014 619.6257 620.9713 633.5421 649.9045 651.5884 656.1414 678.0689 702.0699 702.2350 702.6198 703.9697 739.1315 770.5306 771.2179 773.9096 774.7293 832.9157 851.8695 852.3762 852.4901 852.9392 863.4583 866.1942 867.8066 868.4684 879.9375 891.9024 920.7633 921.3216 926.8033 926.8149 956.5311 961.9950 975.8579 976.0103 976.0532 976.1933 979.3653 987.8737 987.8879 988.2236 988.3217 995.5129 995.5331 995.6763 995.8581 1027.5826 1027.5872 1028.7782 1030.1048 1075.8729 1075.9508 1076.0142 1076.0189 1172.1982 1172.2009 1172.2173 1172.2356 1184.7868 1184.8064 1184.9364 1185.6847 1195.6302 1222.0661 1222.2048 1244.6797 1265.8158 1270.1226 1307.2131 1307.3201 1307.3987 1307.5029 1318.7384 1340.4241 1353.9469 1369.2926 1369.3638 1369.5852 1369.6608 1375.9576 1427.4262 1427.4332 1427.4867 1427.5087 1467.5139 1474.5180 1475.6468 1477.4414 1508.1732 1576.4452 1582.0686 1582.1326 1582.1349 1582.2026 1590.6898 1605.6711 1606.4539 1610.7689 1612.7517 1635.1906 1662.2520 3124.4905 3124.4976 3124.4985 3124.5213 3132.4290 3132.4402 3132.4515 3132.4645 3133.3599 3137.0401 3144.0983 3144.1265 3144.1643 3144.2130 3146.0219 3150.0741 3153.0409 3153.0996 3153.1001 3153.1957 3165.9555 3165.9719 3165.9903 3166.1463
redmass: 4.2140 4.1735 3.7047 3.7373 5.9864 7.7552 6.6593 5.7903 6.3444 5.4670 5.6674 6.3132 5.0200 4.7134 4.6387 5.5695 6.6016 5.4875 6.3316 6.1376 5.3063 5.3985 5.6355 3.9110 9.3889 6.3314 7.6802 3.1826 5.0033 2.8286 2.8299 2.8274 2.8282 4.8695 6.6285 3.7917 7.2335 5.4752 4.2302 4.7568 5.4231 5.6261 5.5974 3.5775 5.6373 6.8524 7.5565 6.4331 6.4513 6.2997 6.0278 6.3371 6.2298 2.7721 4.9546 5.7649 1.6738 1.7447 1.7152 1.6198 5.3782 2.0591 1.9790 2.0303 2.1915 6.0462 1.2443 1.2434 1.2427 1.2441 5.6451 5.5908 1.9046 1.4635 1.4355 1.3253 1.4601 1.5238 1.4494 1.4541 7.0985 3.8639 1.3854 1.3850 1.3854 1.3850 2.9520 6.1375 6.1349 6.1298 5.8463 1.3199 1.3199 1.3233 1.3400 2.1382 2.1328 2.0942 2.0157 1.5969 1.5956 1.5959 1.5964 1.0536 1.0536 1.0536 1.0536 1.1104 1.1180 1.1125 1.1115 4.7484 4.0082 3.7897 3.2885 5.5865 1.2415 1.3672 1.3662 1.3679 1.3673 1.5626 1.4388 1.1612 6.8690 6.8883 6.9057 6.9451 7.8260 2.2110 2.2114 2.2108 2.2111 2.4398 2.3225 2.3254 2.3507 4.5561 8.4315 5.9736 5.9739 5.9776 5.9828 7.9505 6.1379 6.0391 6.4699 6.8591 7.4277 8.1323 1.0846 1.0846 1.0846 1.0845 1.0879 1.0879 1.0879 1.0879 1.0893 1.0899 1.0925 1.0927 1.0927 1.0927 1.0840 1.0855 1.0970 1.0970 1.0970 1.0970 1.1018 1.1018 1.1018 1.1018
irintensity: 0.0142 0.0000 0.0000 0.0000 0.0000 0.0000 1.1573 0.0164 0.1365 0.0004 1.1511 0.0000 0.0000 0.0000 0.0000 0.3997 0.0000 0.0000 0.0003 0.5264 0.0000 0.5528 0.0001 0.0000 0.0000 0.0000 0.3197 0.0000 0.4362 0.0000 0.0108 0.0001 0.0000 0.0001 15.3494 0.0001 1.1272 0.0000 7.1369 44.2885 0.0000 0.0040 0.0006 19.8987 0.0011 1.2415 0.0000 0.0000 0.0017 0.0004 1.2250 97.2966 71.2327 0.0411 0.0004 0.0002 0.0300 152.0779 49.2142 0.0006 112.6851 83.3231 17.3367 0.0017 0.0002 0.0000 0.0000 0.0000 0.0001 0.4849 0.0000 52.6266 0.0010 0.0000 43.3085 0.0024 11.0026 0.0000 0.0000 0.4922 1.8248 0.0000 0.0000 0.0002 0.0000 0.0003 22.1357 0.0004 5.8571 0.0000 11.6261 0.0000 0.0731 0.0000 0.8603 25.3946 0.0314 0.0000 31.3330 0.0001 0.0000 1.0353 34.2938 0.0000 0.0000 0.0000 0.0010 0.0022 14.4315 22.4925 0.0000 26.2178 0.0000 0.0000 56.0159 12.9058 0.0001 0.0002 0.0000 0.0000 2.1446 1.7760 0.0263 99.0633 0.0006 0.1909 0.0001 0.0000 0.0000 0.0049 0.0004 0.0001 31.8202 0.0000 0.0000 36.1110 60.4526 0.0000 0.0001 0.0003 5.7203 0.0761 0.0001 3.2677 54.6100 0.0000 0.0000 12.7040 0.0000 210.5762 0.0051 2.5555 2.5600 0.0018 0.0000 0.0490 0.0030 7.5593 0.0289 9.7192 81.9411 0.0376 26.2760 0.0188 24.5687 0.0429 0.0002 0.0213 0.0283 121.1535 0.0191 75.6245 40.1095 0.0008
temp: 298.150 k
press: 1.00000 atm
elementType: 16 16 6 6 6 6 6 6 6 6 6 6 6 6 6 6 6 6 6 6 6 6 6 6 6 6 6 6 6 6 6 6 6 6 6 6 1 1 1 1 1 1 1 1 1 1 1 1 1 1 1 1 1 1 1 1 1 1 1 1
symmnumber: 1
zpe: 1211516.1 jmol-1
zpe.correction: 0.461442 hartree
zpe.thermalcorrener: 0.488758 hartree
zpe.thermalcorrenthalpy: 0.489702 hartree
zpe.thermalcorrgfe: 0.400403 hartree
zpe.sumelectzpe: -2103.676380 hartree
zpe.sumelectthermal: -2103.649064 hartree
zpe.sumelectthermalent: -2103.648120 hartree
zpe.sumelectthermalfe: -2103.737419 hartree
dipole: 0.0000 -0.0004 0.0009
dipole: 0.0010
quadrupole: -225.8656 -184.4297 -204.9527
quadrupole: -0.0006 0.0035 0.0008
quadrupole: -20.7829 20.6530 0.1300 -0.0006 0.0035 0.0008
hfenergy: -2104.1378221 hartree
pointgroup: C01 [X(C34H24S2)]
dipole: -0.0000005 -0.0001524 0.0003549 debye
polarizability: 609.3212975|-0.0220555|544.9895876|0.0129881|0.0038496|305.7276047 unknown
InChI: InChI=1S/C34H24S2/c1-5-13-25(14-6-1)31-21-29(22-32(35-31)26-15-7-2-8-16-26)30-23-33(27-17-9-3-10-18-27)36-34(24-30)28-19-11-4-12-20-28/h1-24H
charge 0 multiplicity 1
60 atoms
S  4.015815 -0.001273 -0.000249
S  -4.015818 0.001499 -0.000208
C  0.711281 -0.001094 -0.00014
C  -0.711285 -0.00061 -0.00014
C  1.475973 -1.248536 -0.000404
C  1.476094 1.246222 0.000189
C  -1.476838 -1.247523 0.000174
C  -1.475236 1.247235 -0.000407
C  2.836817 -1.407178 -0.000484
C  2.836954 1.404745 0.000264
C  -2.837793 -1.405223 0.000256
C  -2.835985 1.406701 -0.000477
C  3.51736 -2.737834 -0.000943
C  3.517611 2.735343 0.000959
C  -3.519252 -2.73541 0.000921
C  -3.515725 2.737767 -0.000959
C  3.847048 -3.377139 -1.225331
C  3.849719 3.373181 1.225459
C  -3.851651 -3.373126 1.225406
C  -3.845335 3.377091 -1.225358
C  3.843544 -3.379795 1.22299
C  3.841458 3.378727 -1.222845
C  -3.843592 -3.378515 -1.222899
C  -3.841205 3.380108 1.222961
C  4.475885 -4.642547 -1.225007
C  4.478621 4.638553 1.225411
C  -4.481334 -4.638109 1.225325
C  -4.473391 4.642886 -1.225062
C  4.472374 -4.645211 1.221713
C  4.470347 4.644117 -1.221293
C  -4.473263 -4.643517 -1.221379
C  -4.469253 4.645912 1.221657
C  4.789616 -5.279556 -0.001884
C  4.790002 5.276997 0.002433
C  -4.793208 -5.27628 0.00233
C  -4.786416 5.280271 -0.001954
H  0.924775 -2.194538 -0.00071
H  0.924871 2.192244 0.000657
H  -0.926299 -2.193909 0.000615
H  -0.923353 2.192871 -0.000736
H  3.602871 -2.880469 -2.17087
H  3.607318 2.87543 2.170886
H  -3.608871 -2.875583 2.170845
H  -3.601698 2.880134 -2.170885
H  3.596695 -2.885156 2.168898
H  3.592769 2.885201 -2.168853
H  -3.594679 -2.885079 -2.168895
H  -3.594419 2.885457 2.16888
H  4.719788 -5.129525 -2.175815
H  4.72438 5.124402 2.176319
H  -4.727316 -5.123869 2.176221
H  -4.717234 5.129874 -2.17588
H  4.713573 -5.134246 2.172156
H  4.70974 5.134256 -2.171623
H  -4.713036 -5.133445 -2.171723
H  -4.70991 5.135236 2.172088
H  5.277498 -6.260789 -0.002251
H  5.277939 6.258204 0.003011
H  -5.281748 -6.257186 0.002884
H  -5.273696 6.261804 -0.002343
