program: Gaussian 09
title: 000142607
version: EM64L-G09RevD.01
frameworkgroup: C1[X(C7H14Br2)]
method: RPBEPBE
basis: SDD
operation: Freq
keyword: #pfreq=noraman
keyword: PBEPBE/SDD
title: #p freq=noraman PBEPBE/SDD
converged: YES YES NO NO
title: Mulliken charges:
elementType: Br Br C C C C C C C H H H H H H H H H H H H H H
charge: -0.034903 -0.025521 -0.352305 -0.355123 -0.343634 -0.427127 -0.358068 -0.662890 -0.693669 0.207244 0.216459 0.242044 0.236820 0.190545 0.190597 0.318246 0.196255 0.198256 0.309852 0.308500 0.217518 0.210359 0.210544
chargesum: 0.00000
title: Mulliken charges with hydrogens summed into heavy atoms:
elementType: Br Br C C C C C C C
charge: -0.034903 -0.025521 0.071398 0.123740 0.037508 -0.108880 0.036443 -0.044538 -0.055247
polarizability: 1.04731389e+02 3.11918962e+00 1.44098920e+02 1.44608416e+00 -8.91224484e+00 7.85736837e+01
1716.lowfreq: -11.0988 -0.0001 0.0001 0.0002 2.9193 10.9323 25.1692 36.6472 73.3699
frequency: 24.9752 36.5740 73.3690 92.3547 118.0252 131.0141 153.5261 173.8102 213.0971 225.6890 287.9025 353.0327 392.1374 505.2787 554.4680 602.9895 726.1485 750.8757 831.0072 843.5025 897.5294 912.8549 959.2835 1012.1502 1041.2662 1075.3131 1087.4540 1099.6788 1136.0427 1163.0550 1169.7597 1207.8602 1235.6638 1248.4857 1268.2497 1290.6634 1296.9454 1307.8194 1342.6157 1352.3772 1371.2804 1388.2353 1441.8613 1450.7473 1464.2764 1468.9654 1476.6996 1479.2343 1487.1363 2953.1125 2965.9313 2970.0133 2972.5980 2976.3654 2993.9233 3017.4034 3031.4418 3050.9218 3069.0133 3072.9158 3079.9890 3083.1331 3170.0912
redmass: 4.6989 1.7494 4.0326 3.2786 3.3034 2.0222 3.6400 18.8068 2.9019 1.1237 2.6501 3.2474 2.8655 4.2209 3.3107 3.7041 1.0720 1.1629 1.2976 2.3721 1.7341 1.7620 1.3048 2.3597 2.7016 2.0306 1.3648 1.7319 1.5208 2.1206 1.3796 1.4634 1.1660 1.2961 1.2226 1.0613 1.1110 1.3969 1.5173 1.5764 1.4637 1.2183 1.0758 1.1029 1.0672 1.0739 1.0430 1.0726 1.0865 1.0589 1.0593 1.0610 1.0369 1.0612 1.0981 1.1002 1.0997 1.1025 1.1009 1.0992 1.0707 1.0731 1.1117
irintensity: 0.0572 0.0919 1.2963 0.2592 0.8934 0.4405 4.5806 0.3442 2.0970 0.0316 2.2132 1.6415 0.5183 64.5250 18.5888 13.0650 14.9941 3.4724 11.1734 3.8613 1.7103 8.0724 4.9487 0.4664 0.6993 2.0597 3.5544 12.3787 29.2981 4.3297 6.4275 3.1085 11.9008 4.9245 1.9056 1.2517 2.0131 3.3934 0.3542 0.6904 1.3646 12.7510 7.7330 22.2475 0.6773 0.6166 12.5340 3.1267 18.7733 8.3187 20.0769 11.7093 32.5626 76.0318 1.8738 6.9308 12.5698 45.0756 89.8021 50.6631 3.4997 8.1979 3.2512
temp: 298.150 k
press: 1.00000 atm
elementType: 35 35 6 6 6 6 6 6 6 1 1 1 1 1 1 1 1 1 1 1 1 1 1
symmnumber: 1
zpe: 512181.9 jmol-1
zpe.correction: 0.195080 hartree
zpe.thermalcorrener: 0.207409 hartree
zpe.thermalcorrenthalpy: 0.208353 hartree
zpe.thermalcorrgfe: 0.152579 hartree
zpe.sumelectzpe: -301.318433 hartree
zpe.sumelectthermal: -301.306104 hartree
zpe.sumelectthermalent: -301.305160 hartree
zpe.sumelectthermalfe: -301.360933 hartree
dipole: 1.1051 -0.1812 0.3019
dipole: 1.1598
quadrupole: -76.5105 -83.9188 -74.6262
quadrupole: -1.2396 0.0967 -0.4003
quadrupole: 1.8413 -5.5670 3.7256 -1.2396 0.0967 -0.4003
hfenergy: -301.5135124 hartree
pointgroup: C01 [X(C7H14Br2)]
dipole: 0.4359151 0.0267359 -0.1321797 debye
dipolederiv: -0.2045377 -0.0136724 0.0422389 -0.0938123 -0.7817165 0.093293 0.0916314 0.0547887 -0.1981265 -0.1522411 0.057381 0.006951 0.0893189 -0.7152735 -0.0031322 0.0009589 0.0501738 -0.1531968 -0.0761145 -0.0156005 -0.0016089 -0.0501524 0.16028 0.0051681 -0.0066895 0.0408452 0.0447527 -0.0598394 0.0197051 0.0200993 -0.1160288 -0.1029654 0.0621409 0.1502624 0.0642873 0.0087444 0.0048483 -0.0223611 -0.0300544 -0.0033265 0.1781686 0.0061844 -0.0589103 -0.0049764 0.0837952 0.2483783 0.0489396 -0.0993688 0.218265 0.8474516 -0.1873398 -0.229224 -0.1146925 0.1978064 0.0251425 -0.015084 0.0037304 -0.0182335 0.1648613 0.0070841 0.0461539 0.0107316 0.1004967 0.0202057 -0.0767931 0.0408454 -0.1475285 0.8695724 -0.1040522 0.0949145 -0.0529288 0.0373905 -0.0794892 -0.0196891 0.0220331 -0.015748 0.0935074 0.0056678 -0.0174114 0.0018074 0.0615773 0.0494172 0.0232588 0.0268511 0.0445415 -0.0556336 -0.1189544 0.0364473 -0.1042104 -0.0615274 0.0742348 -0.0113677 0.0030879 0.0020459 -0.0585994 0.1049458 -0.0039314 0.0717251 -0.0012374 0.0321555 0.0387956 0.0454935 0.0386896 0.0022887 -0.1290721 -0.0067815 -0.1012317 -0.0250796 0.0261933 -0.0628674 0.0203895 0.0077842 -0.0535128 0.111914 -0.0350646 0.0786295 0.0478824 0.034309 0.0083969 -0.0095838 -0.0090739 -0.1030106 0.1312828 0.0048123 0.1004551 -0.0209158 0.0245784 0.0210975 0.0189284 0.0278544 -0.061392 -0.1392594 0.0299564 -0.109957 -0.0648489 -0.0614512 -0.0179361 -0.0423176 -0.0154895 -0.0410134 0.0591576 -0.0445548 0.0039141 -0.0241392 0.0151325 0.0513461 0.0544401 0.0369636 -0.0564818 -0.1436622 0.0237521 -0.1115669 -0.0625555 0.0285862 -0.0379584 0.0173067 -0.0164859 -0.1119769 0.1408106 -0.0041896 0.1041459 -0.0142302 -0.0382614 0.0180992 0.0455675 -0.0257453 -0.0521325 0.0505556 0.0383023 0.0224653 0.0825012 0.0855442 -0.0104342 -0.0976997 0.0357424 -0.0498768 0.058442 -0.0810332 0.0016443 0.0127336 -0.132504 -0.0117429 -0.1166877 -0.0080733 0.0985264 0.0017994 -0.1580737 -0.0022232 -0.0376564 0.0636905 0.008804 0.0272913 0.0548865 -0.0583197 -0.1355331 0.0807287 -0.120186 -0.0314727 0.0720219 0.0196827 0.0020671 -0.0363942 -0.1127514 0.1225593 0.0479435 0.1163596 0.0173059 unknown
polarizability: 104.3405734|0.3856821|143.9815031|-3.0615721|-9.9715016|79.0819162 unknown
InChI: InChI=1S/C7H14Br2/c1-2-3-4-5-7(9)6-8/h7H,2-6H2,1H3
charge 0 multiplicity 1
23 atoms
Br -2.228439 -2.356671 0.276607
Br -2.624308 2.403347 0.134413
C  0.505894 -0.162133 0.161748
C  -0.596028 -0.180419 -0.918339
C  1.912634 0.023754 -0.45195
C  -2.03255 -0.413731 -0.431105
C  3.038455 0.040309 0.606495
C  -2.538212 0.445201 0.723337
C  4.439861 0.236234 -0.011022
H  0.319482 0.661578 0.880242
H  0.47669 -1.108685 0.736604
H  -0.362468 -0.948694 -1.679613
H  -0.601103 0.794774 -1.449667
H  1.941636 0.970868 -1.030609
H  2.107363 -0.792491 -1.178731
H  -2.744903 -0.407174 -1.272007
H  2.839507 0.849582 1.338442
H  3.014344 -0.909519 1.178636
H  -3.570812 0.20141 1.007443
H  -1.873078 0.434512 1.597323
H  5.226885 0.239299 0.76515
H  4.674791 -0.573909 -0.727023
H  4.501659 1.195759 -0.558375
