program: Gaussian 09
title: 000142592
version: EM64L-G09RevD.01
frameworkgroup: C1[X(C14H16O2)]
method: RPBEPBE
basis: SDD
operation: Freq
keyword: #pfreq=noraman
keyword: PBEPBE/SDD
title: #p freq=noraman PBEPBE/SDD
converged: YES YES NO NO
title: Mulliken charges:
elementType: O O C C C C C C C C C C C C C C H H H H H H H H H H H H H H H H
charge: -0.289196 -0.261438 -0.315123 0.370606 0.263819 -0.275281 0.297455 -0.756766 -0.736822 -0.432207 -0.400026 -0.422534 -0.244719 -0.231892 0.308430 -0.764225 0.303232 0.250425 0.227671 0.225456 0.265606 0.253420 0.220613 0.223120 0.251647 0.242727 0.243444 0.223006 0.224081 0.247009 0.242939 0.245523
chargesum: 0.00000
title: Mulliken charges with hydrogens summed into heavy atoms:
elementType: O O C C C C C C C C C C C C C C
charge: -0.289196 -0.261438 -0.011891 0.370606 0.263819 -0.024856 0.297455 -0.038033 -0.039669 -0.180560 -0.157299 -0.179089 -0.021713 -0.007811 0.308430 -0.028755
polarizability: 1.86339420e+02 -6.73141927e+00 1.69405485e+02 -5.55123263e+00 1.09188487e+01 1.01007401e+02
1716.lowfreq: -15.6870 -7.0712 -0.0009 -0.0009 -0.0006 2.8647 7.7437 40.7857 64.9727
frequency: -14.0964 40.7849 64.9616 73.1707 100.8516 141.9122 172.9494 193.1541 222.2400 233.9509 243.5955 269.9870 290.0780 331.6877 355.5611 386.7462 419.6519 429.1112 475.2664 524.4250 548.5307 566.2385 577.1435 608.0453 640.1464 712.3714 724.5304 741.4433 752.5310 781.6710 825.1375 852.6768 865.7042 887.2749 899.3357 937.8741 941.2958 952.4083 977.0377 983.8218 995.2677 1005.4653 1016.0531 1022.0767 1038.6117 1070.9123 1112.4767 1117.0681 1163.7033 1169.8034 1179.3236 1201.3731 1216.8914 1220.1033 1248.3468 1285.4042 1296.7672 1335.8609 1379.1973 1380.6894 1395.8125 1400.6146 1446.3931 1450.7679 1453.1234 1456.4622 1457.4045 1466.9655 1474.5121 1488.6041 1557.5312 1596.5245 1618.6430 1633.7359 2969.8060 2995.4637 3000.1923 3004.3728 3086.3077 3092.6403 3097.2233 3110.7043 3114.5597 3122.4014 3134.1867 3139.7115 3149.1723 3161.5997 3163.1112 3193.8955
redmass: 1.0799 4.5617 3.9445 3.5869 4.6380 3.8469 3.4115 1.1652 1.7185 3.5652 1.7884 3.0714 2.8449 3.2367 3.1573 3.4339 2.8888 3.1883 3.4995 3.2858 4.3430 3.3195 3.6574 4.9391 4.0289 2.0766 3.5873 3.0753 2.0674 1.7798 2.3021 4.6348 2.4829 1.9607 4.4676 1.5093 1.3359 1.4007 2.2323 1.3329 1.8081 1.5565 2.0433 2.0706 1.6799 1.5780 1.6130 1.3091 1.4589 1.3566 1.9905 1.9867 2.5535 2.3542 2.7734 1.6773 2.0635 2.0277 1.2279 1.2294 1.2223 4.3282 2.4185 1.0676 1.0573 1.1421 2.6526 1.0480 1.0576 1.0524 5.7463 6.6101 7.2964 8.6893 1.0805 1.0359 1.0358 1.0369 1.0991 1.0969 1.0996 1.0998 1.1003 1.0851 1.0900 1.1011 1.0946 1.0884 1.0989 1.1049
irintensity: 1.2727 0.2683 0.4464 3.0359 1.7917 1.3577 6.0885 0.4473 1.7916 1.0369 0.1180 4.6615 1.4695 4.1743 1.6569 0.4488 2.5961 9.4279 5.9127 5.5124 5.1077 4.9588 9.1806 2.3716 4.1927 3.6500 23.1753 21.4205 12.7266 74.9225 10.4560 1.9512 3.3667 18.4295 48.1695 3.0916 0.4001 6.6154 20.0157 0.6704 67.3132 5.1990 9.6349 2.5216 12.2399 7.6391 89.5808 10.5960 32.5590 14.6508 9.7805 200.2867 98.2584 33.7105 35.5406 0.1388 13.5664 4.1983 42.0513 50.7729 29.6311 2.7196 4.9619 30.5642 13.6557 5.1544 21.9058 1.1772 10.7255 14.7364 1.0058 0.6257 0.9099 160.7757 13.4836 11.9864 20.3475 3.1287 12.9567 8.0053 36.8728 12.9698 11.4378 0.8105 10.2004 10.2632 36.8460 7.8330 23.2119 16.3741
temp: 298.150 k
press: 1.00000 atm
elementType: 8 8 6 6 6 6 6 6 6 6 6 6 6 6 6 6 1 1 1 1 1 1 1 1 1 1 1 1 1 1 1 1
symmnumber: 1
zpe: 685658.5 jmol-1
zpe.correction: 0.261154 hartree
zpe.thermalcorrener: 0.275841 hartree
zpe.thermalcorrenthalpy: 0.276786 hartree
zpe.thermalcorrgfe: 0.219720 hartree
zpe.sumelectzpe: -692.366547 hartree
zpe.sumelectthermal: -692.351860 hartree
zpe.sumelectthermalent: -692.350915 hartree
zpe.sumelectthermalfe: -692.407981 hartree
dipole: 0.1254 -0.1988 1.8484
dipole: 1.8633
quadrupole: -88.1687 -83.3917 -102.8870
quadrupole: 2.8719 4.9825 1.2979
quadrupole: 3.3138 8.0908 -11.4046 2.8719 4.9825 1.2979
hfenergy: -692.627701 hartree
pointgroup: C01 [X(C14H16O2)]
dipole: 0.0548656 0.0866522 -0.7258654 debye
polarizability: 186.8509355|5.8511107|168.5289252|6.3648911|11.6759107|101.3724463 unknown
InChI: InChI=1S/C14H16O2/c1-10(15)16-14(2,3)13-9-8-11-6-4-5-7-12(11)13/h4-9,13H,1-3H3
charge 0 multiplicity 1
32 atoms
O  1.994905 -0.490374 -0.67347
O  2.778305 -0.507763 1.540422
C  0.192656 0.817194 0.503816
C  1.328122 0.88231 -0.575977
C  -0.983829 -0.109604 0.197511
C  -0.50095 2.159304 0.733002
C  -2.200392 0.638775 0.289887
C  2.40308 1.932232 -0.226379
C  0.784416 1.08778 -1.996957
C  -1.861108 2.03343 0.622161
C  -1.021665 -1.482386 -0.10494
C  -3.452464 0.017624 0.085305
C  -2.279169 -2.106016 -0.317225
C  -3.482175 -1.363818 -0.220928
C  2.682956 -1.039251 0.408262
C  3.301589 -2.363637 0.006344
H  0.685967 0.505154 1.448849
H  0.041627 3.069917 0.997531
H  3.284113 1.792115 -0.877571
H  2.006235 2.945415 -0.413059
H  2.724067 1.857101 0.824385
H  0.133872 0.249165 -2.292577
H  1.616902 1.159902 -2.717882
H  0.19512 2.0205 -2.038396
H  -2.595218 2.830253 0.769488
H  -0.099686 -2.066955 -0.184345
H  -4.383688 0.590183 0.163903
H  -2.321029 -3.174866 -0.555956
H  -4.44236 -1.866597 -0.383938
H  4.121884 -2.189917 -0.712961
H  2.557576 -3.00448 -0.496488
H  3.700442 -2.871091 0.896682
