program: Gaussian 09
title: 000142581
version: EM64L-G09RevD.01
frameworkgroup: C1[X(C9H10O)]
method: RPBEPBE
basis: SDD
operation: Freq
keyword: #pfreq=noraman
keyword: PBEPBE/SDD
title: #p freq=noraman PBEPBE/SDD
converged: YES YES NO NO
title: Mulliken charges:
elementType: O C C C C C C C C C H H H H H H H H H H
charge: -0.205527 -0.254807 -0.255300 0.082709 0.083764 -0.481400 -0.481752 -0.481069 -0.481923 -0.012679 0.264336 0.264447 0.235004 0.251692 0.256875 0.236114 0.234923 0.251494 0.256920 0.236178
chargesum: 0.00000
title: Mulliken charges with hydrogens summed into heavy atoms:
elementType: O C C C C C C C C C
charge: -0.205527 0.009530 0.009147 0.082709 0.083764 0.005296 0.011238 0.005347 0.011176 -0.012679
polarizability: 1.08731217e+02 -4.35504034e-02 1.12642053e+02 -4.08326443e-01 3.16527971e-02 6.88039418e+01
1716.lowfreq: -8.1100 -0.0009 -0.0007 -0.0002 2.8782 8.0335 50.5260 54.7297 95.5736
frequency: 50.4344 54.6873 95.5729 117.1087 173.9894 206.2829 241.5118 358.1675 372.6516 593.9389 611.3825 622.6878 666.8448 732.6460 783.3247 788.9190 791.0301 805.0303 859.0398 872.2224 877.8296 889.7044 958.6362 1026.2315 1039.8584 1062.9411 1065.1177 1068.2030 1071.6800 1095.6041 1096.7992 1167.1323 1169.3716 1169.4219 1193.1346 1240.1835 1351.4732 1385.3404 1440.5506 1443.7182 1456.6208 1469.7733 1630.4367 1874.4580 3099.9561 3100.3045 3109.1499 3109.3203 3142.1625 3143.2254 3199.4839 3200.1367 3219.1166 3220.6523
redmass: 2.8400 2.9026 3.9285 3.1867 4.6888 2.7814 4.5109 3.8341 4.5053 3.2489 8.6943 3.3714 9.8516 1.4838 1.0598 3.0177 3.1080 1.4343 1.4077 3.9694 1.8076 4.6911 3.4609 1.3186 1.2132 1.2068 1.2317 1.9256 1.5824 1.1718 1.1635 2.6380 1.4395 1.4578 2.3533 1.4469 1.5179 2.7219 1.0872 1.0929 1.2433 1.2430 10.4477 12.2520 1.0515 1.0513 1.0615 1.0616 1.0906 1.0906 1.1177 1.1174 1.1156 1.1151
irintensity: 0.7480 0.7876 0.2590 0.0463 1.9231 0.0004 0.1102 0.3331 0.1983 2.5607 3.1899 0.2886 5.1379 1.9147 0.0442 3.3325 16.0384 1.0677 5.6880 47.9074 5.1217 32.2032 6.8195 39.8278 14.7886 26.8844 0.7177 13.7869 20.2124 0.9047 0.3361 1.0599 1.8780 2.0665 0.4106 10.0874 1.9310 12.4243 0.4371 21.1368 4.6192 0.9056 413.1846 319.1221 18.1178 17.6568 4.5805 10.5172 8.8752 5.3985 0.2324 1.9131 45.0169 0.1455
temp: 298.150 k
press: 1.00000 atm
elementType: 8 6 6 6 6 6 6 6 6 6 1 1 1 1 1 1 1 1 1 1
symmnumber: 1
zpe: 422193.3 jmol-1
zpe.correction: 0.160805 hartree
zpe.thermalcorrener: 0.170742 hartree
zpe.thermalcorrenthalpy: 0.171686 hartree
zpe.thermalcorrgfe: 0.124372 hartree
zpe.sumelectzpe: -423.299665 hartree
zpe.sumelectthermal: -423.289728 hartree
zpe.sumelectthermalent: -423.288784 hartree
zpe.sumelectthermalfe: -423.336097 hartree
dipole: 0.0276 -6.0241 0.0023
dipole: 6.0242
quadrupole: -47.6482 -77.7823 -58.1899
quadrupole: 0.1565 0.9850 -0.0065
quadrupole: 13.5586 -16.5755 3.0169 0.1565 0.9850 -0.0065
hfenergy: -423.4604698 hartree
pointgroup: C01 [X(C9H10O1)]
dipole: 0.0156104 1.9504848 -1.3463716 debye
dipolederiv: -0.3269792 -0.0030276 0.012638 -0.0070271 -1.2630082 0.6559298 0.0069911 0.6553157 -0.7573089 -0.0001845 -0.1392861 0.0507942 -0.4941137 -0.3114325 0.2093344 0.174863 0.1742669 0.0346233 0.0093921 0.0917651 -0.1089074 0.3311545 -0.137772 0.2433145 -0.399026 0.2821752 -0.1489254 0.2876395 0.4440238 -0.2613029 0.2889356 -0.271807 0.1786448 -0.1678802 0.1039112 -0.1669147 0.2770084 -0.4064658 0.3321965 -0.2626753 -0.2716013 0.0980881 0.222931 0.1685035 -0.155148 0.0445262 -0.0378803 -0.0363364 0.1583102 0.1255089 -0.0434399 0.0834203 0.1162264 -0.1566142 0.0027644 -0.0701693 0.0376526 0.0896012 -0.0035891 -0.0772402 -0.2021559 -0.2097568 0.0390285 0.0437115 -0.0209472 -0.047748 0.0208365 -0.1457123 0.014995 0.1757377 -0.14674 0.1156281 0.0005244 0.0621079 -0.0522745 -0.2178752 0.1300946 -0.1616124 0.0144202 -0.0269361 -0.0935739 0.117613 -0.0112548 -0.0448267 -0.0009894 1.6958685 -1.0998994 -0.0307947 -1.0983608 0.8444777 -0.0650362 0.0305822 0.0177095 0.0512853 0.0039788 0.0450375 0.0297248 0.0641436 0.0884262 -0.0659445 0.0062503 0.0345685 0.0098096 0.0416626 0.0781616 0.057412 0.0586159 0.0518123 -0.054172 0.0333003 -0.0985833 0.0186514 0.0936115 0.0102459 -0.0499475 0.0116339 0.0066585 -0.0258081 0.0106787 0.1015508 -0.0399364 0.0912437 0.0128076 0.1038579 0.0239032 -0.0259843 -0.0728738 -0.0727951 -0.0521373 -0.1056969 0.0275791 -0.0224227 -0.0088691 -0.0319039 0.0821117 -0.0101111 0.0867808 0.0620336 0.0363338 0.0263106 -0.06047 0.047436 -0.0597942 0.0547299 -0.0557699 -0.1032275 -0.0059889 -0.0524049 0.0118379 -0.0201683 -0.0029649 -0.0223801 0.0900117 -0.024674 0.0920126 0.0441088 0.1114218 -0.0253716 -0.018479 -0.0026037 -0.0290865 0.0900634 -0.0705191 -0.0215379 -0.0875257 0.0309296 0.0927414 -0.0062569 -0.1032026 0.003049 0.0143495 -0.0111069 0.0290898 0.1023784 0.0334495 0.0898563 -0.0365703 0.0506508 -0.0367859 -0.0074514 unknown
polarizability: 108.5890872|1.4123701|98.5737628|1.9587373|-20.4157736|83.0143622 unknown
InChI: InChI=1S/C9H10O/c10-9-7(5-1-2-5)8(9)6-3-4-6/h5-6H,1-4H2
charge 0 multiplicity 1
20 atoms
O  -0.035738 -2.636317 2.086077
C  1.92412 0.025328 0.131778
C  -1.950114 0.16319 0.285827
C  0.681282 -0.569626 0.620778
C  -0.717625 -0.515068 0.683563
C  1.932429 0.962586 -1.102399
C  2.160994 1.558191 0.279003
C  -1.938203 1.647828 -0.159063
C  -2.163138 0.565852 -1.204815
C  -0.026975 -1.604078 1.378236
H  2.809022 -0.602625 0.272527
H  -2.845047 -0.181749 0.812213
H  0.974632 1.150762 -1.596142
H  2.783446 0.877162 -1.78357
H  3.169756 1.87381 0.557767
H  1.357341 2.140102 0.738613
H  -0.975612 2.167597 -0.147175
H  -2.788145 2.263322 0.14799
H  -3.168184 0.425304 -1.611212
H  -1.352843 0.330027 -1.900096
