program: Gaussian 09
title: 000142566
version: EM64L-G09RevD.01
frameworkgroup: C1[X(C14H20)]
method: RPBEPBE
basis: SDD
operation: Freq
keyword: #p
keyword: freq=noraman
keyword: PBEPBE/SDD
title: #p freq=noraman PBEPBE/SDD
converged: YES YES NO NO
title: Mulliken charges:
elementType: C C C C C C C C C C C C C C H H H H H H H H H H H H H H H H H H H H
charge: 0.000693 0.323047 -0.488744 -0.625028 -0.576298 0.283956 0.280565 -0.757833 -0.755682 -0.743922 -0.395632 -0.401161 -0.254544 -0.249733 0.197940 0.218920 0.207032 0.237650 0.219736 0.220932 0.218840 0.226300 0.208859 0.213189 0.213015 0.209163 0.227591 0.210552 0.210112 0.211501 0.230785 0.229850 0.224061 0.224287
chargesum: 0.00000
title: Mulliken charges with hydrogens summed into heavy atoms:
elementType: C C C C C C C C C C C C C C
charge: 0.198633 0.323047 -0.062791 -0.167641 -0.136527 0.283956 0.280565 -0.109485 -0.105914 -0.111757 -0.164847 -0.171311 -0.030482 -0.025446
polarizability: 1.87587835e+02 -1.64030663e+00 1.47343914e+02 -8.27454803e-01 -2.09579014e+00 9.81276806e+01
1716.lowfreq: -13.4076 -0.0003 -0.0003 0.0005 6.7443 16.4348 49.8996 63.5111 127.3473
frequency: 49.1804 63.4313 127.3355 152.0459 191.9307 208.7126 245.7578 253.5387 256.6203 273.7189 298.3165 320.7144 358.3419 378.2073 429.2041 438.4579 447.9149 478.1289 493.3627 521.5498 577.5510 600.0201 706.4077 728.3783 746.7313 755.8760 816.6657 835.9135 871.9600 892.8385 910.8278 921.2907 924.4216 937.6700 952.7851 955.4216 984.2388 1001.9544 1011.2693 1029.6840 1039.9113 1073.8310 1111.1542 1113.3021 1144.9023 1172.3501 1178.1881 1197.1345 1207.0979 1216.8977 1228.1649 1246.7628 1250.9738 1263.3133 1303.5287 1314.8554 1334.6019 1343.5915 1360.2813 1374.9459 1375.8234 1383.6850 1402.4656 1439.7817 1449.7642 1456.1625 1460.7818 1464.4056 1467.6698 1475.3214 1484.1123 1488.5168 1492.3744 1498.9036 1593.0595 1613.5765 2933.7146 2953.4458 2954.1707 2966.9696 2969.1857 2974.3742 2981.8762 3017.9356 3027.7802 3048.5528 3057.3930 3060.1707 3066.3861 3067.4185 3072.8958 3074.6721 3106.0084 3110.3240 3132.6379 3155.6629
redmass: 3.2138 2.7784 2.6685 2.6193 2.3946 1.1858 1.3554 2.1702 2.3015 1.1752 2.4830 1.9580 2.5657 2.2316 2.4856 2.7403 3.0404 2.9084 2.5990 3.0942 3.4182 5.1122 3.0227 4.2052 1.5697 1.9425 2.0484 3.2337 1.3894 1.6241 2.1403 1.7168 1.6950 1.2331 1.8318 1.5017 1.3196 1.7010 1.5388 2.1082 2.0077 2.0713 2.0475 2.1038 1.2109 1.0647 1.5423 2.4693 1.7355 2.2613 2.0630 1.7529 1.7724 1.6048 1.3697 1.4149 1.3883 1.5148 1.7093 1.2039 1.2121 4.7199 1.2120 2.3644 1.1303 1.0971 1.0747 1.0642 1.0498 1.0785 1.0625 1.2994 1.5927 1.0631 6.5243 6.4086 1.0808 1.0663 1.0646 1.0353 1.0352 1.0375 1.0620 1.0936 1.0940 1.1004 1.0996 1.0993 1.0980 1.0996 1.0982 1.0976 1.0864 1.0891 1.0924 1.1004
irintensity: 0.0410 0.0132 0.1051 0.0118 0.3595 0.0135 0.1733 0.1310 6.1995 0.1287 0.2599 0.0900 0.1353 0.1768 6.5469 0.3845 1.1750 0.0923 0.0782 1.2050 0.5511 2.2511 0.4072 0.5182 45.4771 31.7137 2.6520 3.7147 0.4003 5.2863 2.5552 3.3089 2.2493 0.4197 5.5236 5.1417 0.0202 0.4226 0.1840 4.0595 3.5678 1.8101 6.2472 5.4995 0.4960 0.0836 1.5262 0.4575 2.5193 3.8180 12.3748 12.2027 4.4633 8.2417 2.0770 6.2226 0.0925 0.1869 1.5750 28.0510 24.6454 0.3277 19.5648 4.9991 4.2781 10.5044 4.1677 2.7962 1.9254 4.8442 12.2565 16.9575 8.1312 31.3373 4.7673 0.8180 13.2379 19.2947 37.2849 30.1374 42.6169 11.6299 44.0106 38.1068 26.1478 41.3576 2.6359 26.1597 108.4681 6.7270 67.3439 60.8685 18.2798 2.2899 31.1156 38.7142
temp: 298.150 k
press: 1.00000 atm
elementType: 6 6 6 6 6 6 6 6 6 6 6 6 6 6 1 1 1 1 1 1 1 1 1 1 1 1 1 1 1 1 1 1 1 1
symmnumber: 1
zpe: 788950.0 jmol-1
zpe.correction: 0.300495 hartree
zpe.thermalcorrener: 0.314158 hartree
zpe.thermalcorrenthalpy: 0.315102 hartree
zpe.thermalcorrgfe: 0.261231 hartree
zpe.sumelectzpe: -544.432414 hartree
zpe.sumelectthermal: -544.418751 hartree
zpe.sumelectthermalent: -544.417807 hartree
zpe.sumelectthermalfe: -544.471679 hartree
dipole: -0.8683 0.2077 -0.0405
dipole: 0.8938
quadrupole: -84.5431 -82.0550 -89.8991
quadrupole: 0.5272 -0.1619 -0.4985
quadrupole: 0.9559 3.4441 -4.4001 0.5272 -0.1619 -0.4985
hfenergy: -544.7329094 hartree
pointgroup: C01 [X(C14H20)]
dipole: -0.3427125 -0.0784468 0.0062456 debye
polarizability: 187.5650573|1.1259928|147.3992027|2.3883135|0.3315873|98.0951689 unknown
InChI: InChI=1S/C14H20/c1-14(2,3)13-9-8-11-6-4-5-7-12(11)10-13/h4-7,13H,8-10H2,1-3H3
charge 0 multiplicity 1
34 atoms
C  -1.322985 -0.162005 0.253839
C  -2.83029 0.233287 0.017773
C  -0.879939 -1.444989 -0.499033
C  -0.319178 0.969392 -0.088929
C  0.49275 -1.928718 0.013461
C  1.148304 0.549418 0.002888
C  1.538154 -0.818441 0.032289
C  -3.138145 1.596423 0.699294
C  -3.173558 0.337485 -1.493573
C  -3.750534 -0.83745 0.669425
C  2.153067 1.550742 0.044614
C  2.917207 -1.144434 0.095066
C  3.522486 1.21906 0.108414
C  3.908689 -0.141975 0.133196
H  -1.225865 -0.373475 1.343112
H  -0.812263 -1.228867 -1.583853
H  -1.620345 -2.256337 -0.372855
H  -0.477729 1.837968 0.576968
H  -0.518775 1.331624 -1.119726
H  0.857949 -2.77253 -0.603819
H  0.371967 -2.32981 1.042195
H  -2.622304 2.434898 0.197714
H  -4.224045 1.80541 0.664027
H  -2.828885 1.589571 1.762315
H  -2.526486 1.0677 -2.014495
H  -4.22097 0.669747 -1.624092
H  -3.067794 -0.636673 -2.004445
H  -3.551901 -0.921556 1.755213
H  -4.814173 -0.561474 0.540467
H  -3.611109 -1.836838 0.219148
H  1.851517 2.606313 0.026464
H  3.213241 -2.20153 0.112266
H  4.280336 2.010075 0.139199
H  4.968806 -0.415911 0.179975
