program: Gaussian 09
title: 000142562
version: EM64L-G09RevD.01
frameworkgroup: C1[X(C10H10N2O)]
method: RPBEPBE
basis: SDD
operation: Freq
keyword: #p
keyword: freq=noraman
keyword: PBEPBE/SDD
title: #p freq=noraman PBEPBE/SDD
converged: NO NO NO NO
title: Mulliken charges:
elementType: O N N C C C C C C C C C C H H H H H H H H H H
charge: -0.232876 -0.168218 -0.056261 -0.647323 0.100463 0.346314 0.190061 -0.365133 -0.363129 -0.603712 -0.240156 -0.226356 -0.233375 0.279373 0.279373 0.235284 0.269704 0.242654 0.259230 0.242652 0.228883 0.230236 0.232310
chargesum: 0.00000
title: Mulliken charges with hydrogens summed into heavy atoms:
elementType: O N N C C C C C C C C C C
charge: -0.232876 -0.168218 -0.056261 -0.088576 0.100463 0.346314 0.190061 -0.129849 -0.093425 0.140824 -0.011273 0.003881 -0.001065
polarizability: 2.17622333e+02 2.10714880e+00 1.24879812e+02 3.90502215e-03 3.79520811e-03 5.74165958e+01
1716.lowfreq: -0.0009 -0.0003 0.0011 3.0523 4.1340 13.8678 52.4398 78.0838 116.9018
frequency: 52.4287 78.0760 116.9018 138.5623 176.8118 185.0057 264.1413 313.0897 324.8078 361.4003 402.0098 437.0890 520.0947 546.3652 580.2707 613.3890 638.2632 651.4677 697.5130 763.3129 771.6757 852.2010 869.6919 918.9964 940.9148 956.8495 983.9112 987.3545 1003.2016 1017.8104 1042.0300 1067.4246 1087.7758 1115.3814 1127.7841 1173.9063 1189.5601 1211.6279 1216.9395 1305.1744 1325.9748 1378.6078 1384.6273 1405.5318 1429.0242 1437.3494 1469.0784 1479.6503 1486.8959 1519.4235 1583.8924 1613.3479 1648.3567 2992.6664 3020.5339 3076.7851 3082.0855 3111.9200 3124.0048 3131.5839 3144.0803 3157.2369 3168.2428
redmass: 3.9911 4.9112 4.5370 1.0437 2.8660 3.8296 3.7298 5.6878 5.5346 6.0209 2.8241 2.5894 2.8520 4.3009 4.1042 6.4130 7.2801 5.6661 1.7805 5.1700 1.7816 1.2536 7.3189 1.7341 1.9804 2.8271 1.3758 6.1248 1.3328 3.1109 2.1172 5.8992 1.6725 1.1816 1.3041 1.0576 1.1204 1.7400 2.3672 2.4769 1.9480 4.0527 5.8031 1.1533 1.2158 2.3688 1.0430 2.2939 1.1912 5.2800 6.0909 5.9712 11.3722 1.0330 1.0614 1.1004 1.1025 1.1007 1.0854 1.0878 1.0929 1.0959 1.1009
irintensity: 0.2185 0.0084 0.1678 0.0752 18.5941 3.7291 3.8824 1.9632 0.2392 2.7460 0.0112 0.4889 9.5515 27.7165 0.4889 1.8531 48.6210 2.8389 50.6750 0.2071 62.6883 0.0541 10.6185 5.3486 0.2166 89.5234 0.1776 0.2455 0.2993 0.6540 17.3863 65.5153 7.9508 2.0798 0.4593 0.0880 0.1499 28.9698 50.4892 53.4640 50.7571 12.7193 8.6562 19.8363 25.5482 13.6425 18.0035 6.5683 31.9190 3.4741 1.7477 3.3811 445.0626 57.1891 0.7007 0.6778 24.7783 2.3667 5.7805 1.4386 24.6304 20.6167 20.5162
temp: 298.150 k
press: 1.00000 atm
elementType: 8 7 7 6 6 6 6 6 6 6 6 6 6 1 1 1 1 1 1 1 1 1 1
symmnumber: 1
zpe: 471760.0 jmol-1
zpe.correction: 0.179684 hartree
zpe.thermalcorrener: 0.190855 hartree
zpe.thermalcorrenthalpy: 0.191799 hartree
zpe.thermalcorrgfe: 0.142166 hartree
zpe.sumelectzpe: -570.854172 hartree
zpe.sumelectthermal: -570.843001 hartree
zpe.sumelectthermalent: -570.842057 hartree
zpe.sumelectthermalfe: -570.891690 hartree
dipole: -2.7390 0.7076 0.0001
dipole: 2.8290
quadrupole: -77.4949 -70.8576 -78.0789
quadrupole: 11.0909 0.0016 0.0001
quadrupole: -2.0178 4.6195 -2.6017 11.0909 0.0016 0.0001
hfenergy: -571.0338558 hartree
pointgroup: C01 [X(C10H10N2O1)]
dipole: 1.0814323 0.2631778 -0.0000409 debye
dipolederiv: -1.3302047 -0.4484054 0.0000655 -0.6059718 -0.6763257 0.0000419 0.0000053 -0.0000007 -0.3550815 -1.1527906 0.161977 -0.0000345 -1.2391347 -0.6934518 0.0000379 0.0001562 0.0000359 -0.1788847 0.8497635 -0.0258275 -0.0000004 0.5012454 -0.3397106 0.0000281 -0.0000779 0.0000299 -0.1457983 -0.4278991 0.0332366 -0.0000058 0.073804 -0.2127774 0.0000101 0.000024 0.0000072 0.1608961 0.2222449 0.1290952 0.0000094 0.4113431 0.2314018 -0.0000132 -0.0000486 -0.0000182 -0.0082464 0.2697164 -0.0436215 0.0000026 -0.0970252 -0.0523247 0.0000016 0.0000186 0.0000019 0.0048588 1.13631 0.4151334 -0.000071 1.2034937 1.1697234 -0.0000899 -0.0000936 -0.000058 0.1725471 -0.0841427 0.0793631 0.0000015 0.0793128 0.0189432 -0.0000046 0.000007 -0.000007 -0.1644311 -0.166144 -0.0814297 0.0000026 -0.064662 0.0100433 -0.0000021 -0.0000001 -0.000005 -0.1333321 0.320302 -0.2721508 0.0000403 -0.3319212 0.3070178 -0.0000216 0.0000487 -0.0000057 0.2361107 -0.0316986 -0.1020044 0.0000092 -0.2098106 0.0753767 -0.0000133 0.0000107 -0.0000098 -0.1506929 0.0174544 0.1115318 0.0000034 0.1460009 0.1015509 0.0000006 0.0000079 -0.000002 -0.1464776 -0.0107647 0.0028496 0.0000055 0.0374567 -0.0397057 -0.0000032 -0.000006 -0.0000023 -0.159956 0.095092 0.0151476 0.0332542 0.0251808 0.0840236 -0.0496926 0.0329043 -0.0689168 0.0335796 0.0950984 0.015149 -0.033258 0.0251775 0.0840247 0.0496982 -0.0329149 0.0689216 0.0335729 0.0546211 -0.1036866 -0.0000003 -0.091193 -0.0515034 0.0000035 -0.0000018 0.0000053 0.1481291 0.0795803 0.0808305 -0.0000027 0.0509071 0.006036 0.0000033 -0.0000014 0.0000043 0.1515255 0.0955289 0.0196718 -0.048358 0.1009271 -0.0286702 -0.0886676 0.0288461 -0.1264435 -0.0554532 -0.0187347 -0.002716 0.0000027 -0.113601 0.0812034 0.0000131 0.0000147 0.0000119 0.1348501 0.0955225 0.0196949 0.0483524 0.1009222 -0.0286065 0.0886564 -0.028881 0.1264372 -0.0555251 0.0101415 0.0844027 -0.0000073 0.1166307 -0.0654546 0.0000105 -0.0000097 0.0000102 0.1590293 0.0162886 -0.0829913 -0.0000024 -0.1131469 -0.0726217 0.0000015 -0.0000021 0.0000019 0.1556879 -0.1352856 -0.00525 -0.000009 -0.0059356 0.0918076 0.0000015 -0.0000064 0.0000015 0.1630917 unknown
polarizability: 217.5445876|-3.412386|124.9575582|0.0038512|-0.0038498|57.4165958 unknown
InChI: InChI=1S/C10H10N2O/c1-12-10(13)7-9(11-12)8-5-3-2-4-6-8/h2-6H,7H2,1H3
charge 0 multiplicity 1
23 atoms
O  -3.778378 -1.341592 -0.000129
N  -2.474486 0.643712 -0.000302
N  -1.117439 1.038415 -0.00035
C  -1.236686 -1.327869 -0.000145
C  -0.376767 -0.073798 -0.000237
C  1.089155 -0.030706 -0.000211
C  -2.665663 -0.752283 -0.00014
C  1.846454 -1.235476 -0.000148
C  1.780685 1.216289 -0.000219
C  -3.52722 1.652058 -0.000467
C  3.257046 -1.196023 -0.0001
C  3.187286 1.25045 -0.000167
C  3.933991 0.045161 -0.000109
H  -1.080201 -1.962831 -0.890313
H  -1.080163 -1.962783 0.890041
H  1.333075 -2.204236 -0.000131
H  1.194722 2.141043 -0.000256
H  -3.457044 2.289857 0.89783
H  -4.492064 1.118566 -0.000372
H  -3.457052 2.289565 -0.898976
H  3.827403 -2.131627 -0.000051
H  3.706719 2.215301 -0.00017
H  5.029226 0.074808 -0.000077
