program: Gaussian 09
title: 000142558
version: EM64L-G09RevD.01
frameworkgroup: C1[X(C13H28O)]
method: RPBEPBE
basis: SDD
operation: Freq
keyword: #pfreq=noraman
keyword: PBEPBE/SDD
title: #p freq=noraman PBEPBE/SDD
converged: YES YES NO NO
title: Mulliken charges:
elementType: O C C C C C C C C C C C C C H H H H H H H H H H H H H H H H H H H H H H H H H H H H
charge: -0.485806 0.298047 0.248714 0.245520 0.238263 -0.747026 -0.827445 -0.759398 -0.764955 -0.763028 -0.738020 -0.785744 -0.755253 -0.767867 0.247772 0.199232 0.207920 0.227774 0.221825 0.263002 0.246438 0.206194 0.210178 0.208892 0.237329 0.214164 0.271364 0.192918 0.230819 0.199809 0.243700 0.200976 0.198634 0.217263 0.225037 0.227616 0.242815 0.209888 0.218509 0.245360 0.206210 0.342362
chargesum: 0.00000
title: Mulliken charges with hydrogens summed into heavy atoms:
elementType: O C C C C C C C C C C C C C
charge: -0.143444 0.298047 0.248714 0.245520 0.238263 -0.092103 -0.114845 -0.096588 -0.104570 -0.067927 -0.093535 -0.144810 -0.074934 -0.097788
polarizability: 1.50875650e+02 -3.78860247e-01 1.51446702e+02 -1.62276405e-01 6.71660628e-01 1.31263866e+02
1716.lowfreq: -23.1947 -19.1641 0.0002 0.0005 0.0006 5.7441 98.7964 122.1143 128.6076
frequency: 98.6660 122.0866 128.5526 168.2389 173.9847 188.9823 211.6854 221.1122 242.7469 251.0923 256.5217 276.8844 290.0351 303.0444 303.6105 317.8226 326.7157 335.1739 355.6078 362.1518 365.7571 373.3400 390.1394 395.6764 418.8437 424.1022 428.1368 454.4014 464.1636 470.7873 548.4612 555.8067 561.6066 601.0349 766.9541 777.5407 819.3316 862.0458 875.4741 907.7525 912.4537 920.1433 923.9556 925.1896 928.1328 944.1541 945.4803 948.6904 957.3965 1009.6308 1018.5655 1021.8609 1028.6698 1037.5936 1043.5581 1165.6499 1176.3672 1189.5871 1194.5908 1198.8742 1205.4308 1207.9334 1213.6274 1225.4942 1260.1196 1365.4510 1370.1782 1372.9891 1378.2732 1381.0923 1382.5950 1400.8733 1402.7072 1415.7083 1456.1430 1458.2421 1463.6198 1465.7047 1470.8373 1472.8438 1476.8676 1480.3820 1484.7628 1490.2791 1493.6616 1498.6946 1503.8425 1505.1112 1510.6112 1515.6435 1526.1341 1528.1503 2971.4361 2982.8131 2985.1265 2986.6367 2988.6242 2990.2859 2991.0816 2992.4359 2999.2618 3048.5649 3061.4345 3067.3575 3071.4168 3073.7261 3075.8827 3079.6317 3081.8054 3089.7122 3103.6359 3109.7146 3114.4663 3117.5808 3118.0626 3121.7170 3124.8545 3134.1263 3147.8957 3560.2472
redmass: 1.8076 2.1736 1.5245 1.3833 1.2988 1.5103 1.2886 1.3925 1.9241 1.8462 2.0152 2.4958 1.4816 2.6564 2.6653 2.0875 2.5053 2.6385 1.7981 2.3641 1.2450 2.4192 1.4818 1.4808 1.2030 2.1337 2.2121 2.1400 2.1648 2.3841 3.3292 2.6169 2.2736 2.3898 3.4809 3.5418 2.6127 2.7089 3.3549 2.0748 1.6132 1.9733 1.7951 1.6286 1.6717 1.2414 2.5217 1.2256 1.2355 1.3711 1.3400 1.3377 1.3502 1.4307 1.5113 2.3460 1.9262 2.2761 2.6499 2.4340 2.2191 2.8452 2.9993 3.2061 1.6519 1.1906 1.1821 1.1862 1.1826 1.1757 1.1710 1.1890 1.1824 1.1811 1.0542 1.0538 1.0548 1.0475 1.0525 1.0494 1.0528 1.0514 1.0517 1.0519 1.0525 1.0523 1.0516 1.0481 1.0562 1.0532 1.0509 1.0505 1.0404 1.0407 1.0410 1.0423 1.0405 1.0414 1.0412 1.0414 1.0411 1.0964 1.0975 1.0937 1.0943 1.0931 1.0928 1.0907 1.0907 1.0908 1.0989 1.0987 1.0964 1.0998 1.0972 1.0997 1.0971 1.0991 1.0905 1.0650
irintensity: 0.0982 0.2628 0.2288 1.1809 0.1993 1.6536 0.0901 0.9499 1.7316 0.4519 0.2719 0.3294 1.7735 4.4152 1.7152 13.1135 0.5423 23.0860 5.8364 36.4112 0.7409 9.9315 17.3966 37.2920 1.5222 5.2493 1.3192 0.7109 3.2567 13.5786 2.3798 0.5855 0.6481 0.7367 5.9046 0.1990 0.1767 28.4210 26.5067 1.2148 4.4451 2.3450 3.4622 11.3655 4.7162 3.7190 45.4987 2.1802 1.2326 0.1409 1.1437 1.9604 3.6360 9.9670 12.3027 0.7961 45.9984 21.9509 2.7657 11.4917 0.6051 10.6926 12.8360 9.8610 29.9387 3.1642 8.1309 11.4218 8.9911 4.8999 48.5484 53.6341 63.2586 1.0066 5.7314 5.1759 5.7812 4.7009 3.7389 0.4060 2.5124 3.6713 6.0283 10.8857 0.4527 21.7457 8.9361 2.5209 11.3198 12.8371 8.8168 14.0093 31.4468 23.9737 22.7918 27.8300 10.2465 35.7550 103.7925 37.3312 61.2987 39.3445 15.6507 12.8885 61.9128 57.0637 121.7933 13.3110 1.8960 16.5564 18.6435 23.2526 9.2336 11.8790 41.1094 29.5649 43.2051 19.3269 17.7673 2.8429
temp: 298.150 k
press: 1.00000 atm
elementType: 8 6 6 6 6 6 6 6 6 6 6 6 6 6 1 1 1 1 1 1 1 1 1 1 1 1 1 1 1 1 1 1 1 1 1 1 1 1 1 1 1 1
symmnumber: 1
zpe: 1007615.5 jmol-1
zpe.correction: 0.383780 hartree
zpe.thermalcorrener: 0.401659 hartree
zpe.thermalcorrenthalpy: 0.402603 hartree
zpe.thermalcorrgfe: 0.342969 hartree
zpe.sumelectzpe: -586.146445 hartree
zpe.sumelectthermal: -586.128566 hartree
zpe.sumelectthermalent: -586.127622 hartree
zpe.sumelectthermalfe: -586.187256 hartree
dipole: 0.1741 -1.4051 0.7371
dipole: 1.5962
quadrupole: -92.3877 -91.4112 -94.0105
quadrupole: 0.0518 -0.3933 2.9917
quadrupole: 0.2154 1.1919 -1.4073 0.0518 -0.3933 2.9917
hfenergy: -586.5302251 hartree
pointgroup: C01 [X(C13H28O1)]
dipole: -0.1263517 0.5402979 0.2940893 debye
polarizability: 150.8734118|-0.4084879|151.4005152|1.1536804|-0.311423|131.3122908 unknown
InChI: InChI=1S/C13H28O/c1-10(2,3)13(14,11(4,5)6)12(7,8)9/h14H,1-9H3
charge 0 multiplicity 1
42 atoms
O  0.122483 -0.028391 -1.790128
C  0.023705 0.001467 -0.300856
C  1.244862 0.983906 0.194706
C  0.230733 -1.575224 0.079523
C  -1.488484 0.584817 0.042545
C  2.659553 0.328689 0.082296
C  1.412156 2.22967 -0.749119
C  1.116499 1.486865 1.664983
C  0.568922 -1.837583 1.579322
C  1.359312 -2.246076 -0.785101
C  -1.027855 -2.442949 -0.245179
C  -1.625557 2.13139 -0.172822
C  -2.577747 -0.003403 -0.930695
C  -1.967458 0.315147 1.500413
H  2.833917 -0.069667 -0.929527
H  3.41539 1.116064 0.269394
H  2.839653 -0.468388 0.819194
H  1.811917 1.919141 -1.732036
H  2.163601 2.90406 -0.297237
H  0.508612 2.829522 -0.91317
H  0.991525 0.656672 2.378629
H  2.048404 2.018587 1.938227
H  0.285793 2.194605 1.816658
H  0.650275 -2.931895 1.726649
H  -0.206561 -1.470603 2.271126
H  1.532397 -1.400929 1.885799
H  1.307334 -1.899848 -1.828812
H  1.204471 -3.341272 -0.774181
H  2.372025 -2.065915 -0.399479
H  -1.894733 -2.217217 0.393501
H  -1.323546 -2.3422 -1.301913
H  -0.768043 -3.502943 -0.065513
H  -1.478052 2.425793 -1.230389
H  -2.662963 2.414951 0.085384
H  -0.960201 2.737783 0.458452
H  -3.05401 -0.914729 -0.541453
H  -2.149555 -0.236216 -1.919395
H  -3.382865 0.742325 -1.070203
H  -2.059696 -0.759648 1.718685
H  -1.309556 0.765086 2.260519
H  -2.974803 0.757161 1.628156
H  -0.076857 0.881096 -2.127952
