program: Gaussian 09
title: 000142538
version: EM64L-G09RevD.01
frameworkgroup: C1[X(C8H10)]
method: RPBEPBE
basis: SDD
operation: Freq
keyword: #p
keyword: freq=noraman
keyword: PBEPBE/SDD
title: #p freq=noraman PBEPBE/SDD
converged: YES YES NO NO
title: Mulliken charges:
elementType: C C C C C C C C H H H H H H H H H H
charge: -0.184509 -0.184509 -0.469959 -0.469958 -0.255078 -0.255076 -0.215004 -0.215002 0.226671 0.226670 0.214199 0.219837 0.214198 0.219837 0.237042 0.237042 0.226800 0.226800
chargesum: 0.00000
title: Mulliken charges with hydrogens summed into heavy atoms:
elementType: C C C C C C C C
charge: 0.042162 0.042161 -0.035923 -0.035923 -0.018037 -0.018035 0.011796 0.011798
polarizability: 8.60049974e+01 1.00932696e+01 8.33189999e+01 4.78607509e-04 5.42029845e-04 5.90432523e+01
1716.lowfreq: -9.8938 -8.6917 -0.0002 -0.0002 0.0006 18.9382 76.6830 213.9375 296.2761
frequency: 76.6709 213.9350 296.2717 419.7166 450.7812 586.0749 680.8953 692.2508 743.7033 784.9602 794.0596 808.2677 861.6979 920.7183 944.4358 946.7856 952.7714 956.4251 997.3982 1044.3446 1050.7194 1061.4753 1095.8655 1112.9925 1144.9799 1152.2405 1177.9313 1223.5615 1268.3152 1271.6718 1285.2513 1294.1300 1331.3246 1341.3001 1461.5984 1464.2613 1634.5033 1636.3662 2966.7866 2968.3095 2985.8956 3002.5513 3017.3630 3021.0540 3126.1748 3126.2482 3161.0193 3162.4691
redmass: 2.4250 3.5125 1.8542 2.9773 1.9920 4.4936 1.2816 2.4306 2.1552 3.4572 3.0976 2.3217 2.6754 1.6034 1.7934 1.2673 1.5794 2.4014 2.1357 2.1970 1.8962 2.0063 1.0599 1.0935 1.1070 1.1268 1.8932 1.3233 1.3022 1.4088 1.4704 1.8510 1.7699 1.8121 1.0992 1.0855 6.3512 6.4369 1.0638 1.0619 1.0809 1.0860 1.1007 1.0994 1.0853 1.0854 1.1069 1.1067
irintensity: 0.3167 0.6835 0.1005 0.5285 6.3568 0.5331 37.7988 37.4223 39.0670 1.4574 12.6920 7.2367 8.1958 2.3440 2.1635 0.6271 0.0219 14.2697 0.9720 6.1971 0.1659 0.1609 0.1894 1.8464 2.6962 7.1625 0.4241 2.1076 0.0465 3.3799 1.9155 2.7861 5.1933 1.5639 16.7433 0.0253 7.1418 0.1586 72.6297 0.0748 57.7267 27.5068 16.1217 88.7586 13.6594 1.2217 60.2998 9.4863
temp: 298.150 k
press: 1.00000 atm
elementType: 6 6 6 6 6 6 6 6 1 1 1 1 1 1 1 1 1 1
symmnumber: 1
zpe: 405046.7 jmol-1
zpe.correction: 0.154274 hartree
zpe.thermalcorrener: 0.160771 hartree
zpe.thermalcorrenthalpy: 0.161716 hartree
zpe.thermalcorrgfe: 0.123601 hartree
zpe.sumelectzpe: -310.214144 hartree
zpe.sumelectthermal: -310.207646 hartree
zpe.sumelectthermalent: -310.206702 hartree
zpe.sumelectthermalfe: -310.244817 hartree
dipole: 0.0000 0.0000 0.2505
dipole: 0.2505
quadrupole: -47.2433 -45.5263 -48.6671
quadrupole: 1.6136 0.0001 0.0001
quadrupole: -0.0978 1.6193 -1.5215 1.6136 0.0001 0.0001
hfenergy: -310.3684178 hartree
pointgroup: C01 [X(C8H10)]
dipole: 0.0000007 0.0000039 0.0985675 debye
dipolederiv: 0.0187122 -0.0142264 0.0420183 -0.035928 -0.0407922 -0.0518272 0.0375867 -0.0529445 0.184402 0.0187166 -0.0142281 -0.0420147 -0.0359322 -0.0407861 0.0518393 -0.0375873 0.0529535 0.1843981 0.0333949 0.0073689 -0.1094561 0.0202229 0.0119805 0.0138513 -0.0691231 0.0815048 0.1291784 0.0333975 0.0073679 0.1094565 0.0202231 0.0119843 -0.0138517 0.0691239 -0.0815094 0.1291786 0.0062384 -0.0336694 -0.1515566 0.0061885 0.0028455 0.0373295 -0.220309 0.0730797 -0.1530831 0.0062425 -0.033666 0.1515552 0.006196 0.0028425 -0.0373366 0.2203077 -0.0730829 -0.153083 -0.0961862 0.0035032 0.1481926 -0.0360218 0.1275963 -0.0652216 0.1073189 -0.0842089 -0.1398888 -0.096193 0.0035031 -0.1481964 -0.0360228 0.1276003 0.0652135 -0.1073179 0.0842044 -0.1398832 0.0087352 -0.007852 0.0017161 0.0314108 0.0191272 0.0888858 0.0102785 0.1118864 -0.159196 0.0087332 -0.0078536 -0.0017183 0.0314104 0.0191167 -0.088897 -0.0102817 -0.1118954 -0.1591863 -0.0814628 -0.0631754 0.0973215 -0.0684011 0.0007905 0.0559962 0.1280588 0.1229562 -0.0345646 0.0854458 0.0616172 0.0051051 -0.0093072 -0.0836242 -0.1049598 -0.0107485 -0.1319036 -0.0341443 -0.0814641 -0.0631755 -0.0973206 -0.0684024 0.0007857 -0.0559927 -0.1280613 -0.1229549 -0.0345614 0.085445 0.0616141 -0.0051043 -0.0093079 -0.083621 0.1049624 0.0107527 0.1319069 -0.0341472 0.0796494 0.019304 0.0480966 0.0551015 -0.1079015 -0.0646713 0.0753667 -0.0707496 0.1243607 0.0796464 0.0193058 -0.0480975 0.055101 -0.107897 0.0646804 -0.075369 0.0707579 0.1243571 -0.0545305 0.0271287 -0.1384827 0.0367319 0.0699776 0.0336973 -0.1663431 0.0380828 0.0829347 -0.0545205 0.0271335 0.1384853 0.0367372 0.0699748 -0.033698 0.1663468 -0.0380835 0.0829281 unknown
polarizability: 84.7007511|10.1821528|84.6232462|-0.0004428|-0.0005716|59.0432523 unknown
InChI: InChI=1S/C8H10/c1-3-7-5-2-6-8(7)4-1/h1-3,6-8H,4-5H2
charge 0 multiplicity 1
18 atoms
C  -0.063053 -0.789458 0.675601
C  0.063041 0.789535 0.675562
C  -1.46023 -1.128613 0.041536
C  1.460214 1.128655 0.041471
C  1.12538 -1.232506 -0.16596
C  -1.125408 1.232543 -0.165996
C  -1.936875 0.202429 -0.518229
C  1.936838 -0.202407 -0.518258
H  0.00335 -1.212285 1.696869
H  -0.003352 1.212415 1.696809
H  -2.170177 -1.51796 0.799554
H  -1.378785 -1.906048 -0.743289
H  2.17017 1.517999 0.799484
H  1.378782 1.906083 -0.743361
H  1.281272 -2.281159 -0.444401
H  -1.281311 2.281183 -0.444479
H  -2.844045 0.29519 -1.125927
H  2.843987 -0.295195 -1.125984
