program: Gaussian 09
title: 000142505
version: EM64L-G09RevD.01
frameworkgroup: C1[X(C7H10I2)]
method: RPBEPBE
basis: SDD
operation: Freq
keyword: #pfreq=noraman
keyword: PBEPBE/SDD
title: #p freq=noraman PBEPBE/SDD
converged: NO NO NO NO
title: Mulliken charges:
elementType: I I C C C C C C C H H H H H H H H H H
charge: 0.052751 0.052752 -0.340538 -0.340538 -0.368103 -0.378224 -0.378230 -0.378228 -0.378224 0.265044 0.265043 0.254886 0.226737 0.226741 0.254883 0.226739 0.254884 0.254886 0.226738
chargesum: 0.00000
title: Mulliken charges with hydrogens summed into heavy atoms:
elementType: I I C C C C C C C
charge: 0.052751 0.052752 -0.340538 -0.340538 0.161984 0.103399 0.103395 0.103395 0.103400
polarizability: 1.86656961e+02 2.87167362e-02 8.54696860e+01 9.69464123e-03 1.39270647e-03 7.96203295e+01
1716.lowfreq: -1.1975 0.0004 0.0004 0.0005 10.0111 25.2754 80.8964 135.5358 156.9405
frequency: 80.8964 135.4042 156.9132 175.8741 218.9632 258.4501 275.9123 378.9798 405.0212 452.1088 517.4775 734.5552 738.8287 796.7125 819.0477 829.6158 918.2590 936.3163 951.9989 953.0837 975.3735 992.0471 999.3268 1031.1975 1039.8804 1139.2259 1164.2360 1198.2859 1218.5720 1229.5260 1238.1411 1240.1090 1246.0104 1264.7789 1273.7726 1298.5229 1461.7919 1464.7859 1472.4420 1476.2333 1497.4774 3020.8321 3021.6769 3031.6514 3033.8430 3045.5168 3079.7436 3084.0961 3099.4159 3107.1721 3123.3921
redmass: 12.6211 4.8578 1.9939 13.6752 2.6725 3.0962 6.7013 1.8985 2.4035 1.8423 3.9355 4.3333 4.8894 1.1746 3.0663 1.4580 4.1926 3.1357 1.4755 2.5148 3.0483 2.9657 1.7309 2.8029 1.3265 2.4909 1.3233 1.6159 1.3223 1.2040 1.4976 1.2812 1.4750 1.4139 1.6225 1.4267 1.0792 1.0915 1.0889 1.0810 1.0992 1.0582 1.0584 1.0614 1.0615 1.0602 1.1070 1.1064 1.1063 1.1056 1.1087
irintensity: 0.3350 0.2875 0.0000 1.1223 0.0149 0.0000 13.7562 0.1689 0.0000 0.2511 0.0000 5.6343 58.4826 0.5478 42.5992 0.5211 5.6053 0.1572 0.0000 0.1647 5.0062 83.5727 0.0000 1.5350 1.6966 2.2406 0.0000 17.9634 29.9453 0.0634 10.1701 0.0000 4.2598 20.3317 0.0000 24.9694 0.0000 16.6588 16.0447 5.0695 0.4497 0.0010 28.2184 45.0639 38.1890 3.8868 0.0000 0.7831 9.9304 46.9842 15.7420
temp: 298.150 k
press: 1.00000 atm
elementType: 53 53 6 6 6 6 6 6 6 1 1 1 1 1 1 1 1 1 1
symmnumber: 1
zpe: 402564.3 jmol-1
zpe.correction: 0.153329 hartree
zpe.thermalcorrener: 0.162379 hartree
zpe.thermalcorrenthalpy: 0.163323 hartree
zpe.thermalcorrgfe: 0.116246 hartree
zpe.sumelectzpe: -295.057612 hartree
zpe.sumelectthermal: -295.048561 hartree
zpe.sumelectthermalent: -295.047617 hartree
zpe.sumelectthermalfe: -295.094695 hartree
dipole: 0.0000 -1.6338 0.0000
dipole: 1.6338
quadrupole: -95.6006 -81.9316 -81.9635
quadrupole: 0.0000 0.0000 0.0000
quadrupole: -9.1021 4.5670 4.5350 0.0000 0.0000 0.0000
hfenergy: -295.2109406 hartree
pointgroup: C01 [X(C7H10I2)]
dipole: -0.0000053 0.0001279 0.6427984 debye
dipolederiv: -0.628736 0.000026 0.1356746 0.000081 -0.1071341 -0.0000494 0.1741725 -0.0000157 -0.1672898 -0.6284971 -0.0000087 -0.1357171 0.0001293 -0.1071231 0.0000437 -0.1742707 -0.0000149 -0.1671805 1.0829399 -0.000094 -0.3362302 -0.0000848 0.0892688 0.0000745 -0.3189878 0.0000388 0.1613397 1.0823231 0.0000149 0.3361948 -0.0001788 0.0892551 -0.0000549 0.3190812 -0.0000092 0.1609993 -0.2907648 0.0000281 0.0000076 0.000272 0.053318 -0.0000098 0.0004879 -0.0000285 -0.0991475 -0.1728943 0.1096849 0.1336806 -0.1374097 0.0038594 -0.0299587 -0.0431869 -0.0761819 0.0737874 -0.1729994 -0.1095605 0.133683 0.1374754 0.0038979 0.0299414 -0.0433477 0.0762224 0.0737066 -0.17301 -0.1096184 -0.1335321 0.1373425 0.0038605 -0.0299201 0.0430215 -0.076179 0.0738937 -0.1727903 0.1096297 -0.1334705 -0.1370672 0.0039049 0.029997 0.0432325 0.076232 0.0738632 0.0672818 -0.0000143 -0.000022 -0.0000743 -0.0470358 0.1140974 -0.0000632 0.0721034 0.019984 0.0672721 -0.0000142 -0.0000314 -0.0001987 -0.0471071 -0.1140919 -0.0000735 -0.0720694 0.0200542 0.0009896 -0.0619004 -0.0053283 -0.059942 -0.0634056 0.0479083 0.0331252 0.0923782 0.0524847 -0.0159757 -0.0189719 -0.0887037 0.0245691 0.078698 0.0273134 -0.0769499 -0.0226367 -0.108494 -0.0159909 0.0189356 -0.0887198 -0.0246234 0.0786926 -0.0273719 -0.0767911 0.0225664 -0.1084556 0.0009501 0.0618648 -0.0053689 0.0598751 -0.0634666 -0.0478613 0.033083 -0.0923466 0.0525418 -0.0159827 0.0189696 0.0886715 -0.0244938 0.0786959 0.027297 0.0768995 -0.0226501 -0.1085077 0.0009596 0.0618652 0.0052606 0.0598409 -0.0634218 0.0479211 -0.0330817 0.0923843 0.052433 0.0009226 -0.0618961 0.0052841 -0.0600086 -0.0634527 -0.0478883 -0.0332382 -0.0923455 0.0524781 -0.0159976 -0.0189404 0.088667 0.024496 0.0786954 -0.0273878 0.0768873 0.0225521 -0.1084906 unknown
polarizability: 186.6569621|0.0039741|79.6203297|0.0287782|0.0027046|85.4696852 unknown
InChI: InChI=1S/C7H10I2/c8-6-1-2-7(9,5-6)4-3-6/h1-5H2
charge 0 multiplicity 1
19 atoms
I  3.185488 -0.000311 -0.863598
I  -3.185479 0.000029 -0.863601
C  1.118051 -0.000032 -0.074856
C  -1.118042 0.000085 -0.074863
C  0.000008 -0.000184 -1.155596
C  0.789971 1.272375 0.763123
C  0.789837 -1.272088 0.763602
C  -0.789831 1.272464 0.763104
C  -0.789958 -1.272005 0.763606
H  0.000055 0.902877 -1.786577
H  -0.00004 -0.903495 -1.786215
H  1.185797 2.178277 0.274841
H  1.225519 1.208659 1.774551
H  1.225421 -1.208072 1.774994
H  1.185545 -2.178207 0.275626
H  -1.225413 1.208831 1.774521
H  -1.18553 2.178399 0.274779
H  -1.185773 -2.178091 0.275661
H  -1.225527 -1.207909 1.774998
