program: Gaussian 09
title: 000142504
version: EM64L-G09RevD.01
frameworkgroup: C1[X(C5H11O3P)]
method: RPBEPBE
basis: SDD
operation: Freq
keyword: #p
keyword: freq=noraman
keyword: PBEPBE/SDD
title: #p freq=noraman PBEPBE/SDD
converged: YES YES NO NO
title: Mulliken charges:
elementType: P O O O C C C C C H H H H H H H H H H H
charge: 1.032594 -0.535420 -0.519171 -0.510030 0.015939 -0.268261 -0.338315 -0.658720 -0.653174 0.191363 0.222049 0.228840 0.239697 0.236362 0.199859 0.232917 0.224858 0.204969 0.230682 0.222961
chargesum: 0.00000
title: Mulliken charges with hydrogens summed into heavy atoms:
elementType: P O O O C C C C C
charge: 1.032594 -0.535420 -0.519171 -0.510030 0.207302 0.182628 0.137744 -0.001086 0.005439
polarizability: 1.12842503e+02 1.56149095e+00 7.60826152e+01 3.90758824e+00 8.85091931e-01 7.23503859e+01
1716.lowfreq: -25.7811 -15.4375 -8.4618 -0.0024 -0.0020 -0.0014 19.0704 34.4293 78.4998
frequency: 9.0070 34.2419 78.4839 155.5136 177.2630 186.5084 234.2050 245.3079 277.2203 362.8733 397.9476 435.5897 531.6711 551.6860 591.2500 635.6381 659.8952 819.4581 831.5341 868.3724 917.4426 921.0652 934.7224 951.0879 985.4741 1092.4246 1100.5889 1148.7274 1158.6298 1178.5546 1191.7663 1314.0082 1322.3472 1324.4087 1332.4785 1376.7752 1392.3357 1451.6119 1457.2127 1463.4283 1466.3117 1466.7947 1483.5050 2946.7827 2981.9792 2989.7610 3012.5409 3018.4525 3080.4428 3087.5980 3091.5059 3093.5616 3102.1777 3114.0537
redmass: 3.0803 4.1539 3.3351 3.7487 2.2610 1.0846 1.6289 2.2148 3.3594 3.0603 4.0329 2.5875 10.5055 6.7670 3.4008 6.7120 7.8054 4.1231 2.2149 4.1426 1.7164 1.6906 1.4098 2.9044 4.1335 1.5645 1.7051 2.0458 1.1186 1.9915 1.2379 1.2289 1.2988 1.2667 1.2681 1.2558 1.2222 1.0480 1.0905 1.0485 1.0867 1.0546 1.0498 1.0850 1.0354 1.0359 1.0610 1.0619 1.0994 1.1002 1.0997 1.1037 1.1004 1.1070
irintensity: 0.6408 1.7051 7.5440 1.3194 1.5761 0.1801 0.9270 0.6365 7.8420 12.6973 11.1526 9.2987 12.5856 38.1530 33.4783 154.2655 27.8578 149.2130 3.0477 87.4320 52.1695 46.1697 0.0587 4.0717 62.5216 2.1187 76.2116 9.9371 4.2912 18.8617 5.9558 7.1986 13.9961 3.4227 25.5128 30.3210 20.9271 4.5289 6.7148 4.1442 0.4803 13.0378 11.8739 37.8967 17.6425 25.4790 63.6899 33.5677 15.0705 32.4457 49.2325 17.4739 33.2847 26.6585
temp: 298.150 k
press: 1.00000 atm
elementType: 15 8 8 8 6 6 6 6 6 1 1 1 1 1 1 1 1 1 1 1
symmnumber: 1
zpe: 418897.7 jmol-1
zpe.correction: 0.159550 hartree
zpe.thermalcorrener: 0.170629 hartree
zpe.thermalcorrenthalpy: 0.171573 hartree
zpe.thermalcorrgfe: 0.120428 hartree
zpe.sumelectzpe: -763.289939 hartree
zpe.sumelectthermal: -763.278859 hartree
zpe.sumelectthermalent: -763.277915 hartree
zpe.sumelectthermalfe: -763.329061 hartree
dipole: -0.4767 0.9481 0.9236
dipole: 1.4069
quadrupole: -50.8784 -67.5043 -59.9753
quadrupole: 1.2726 5.7442 2.2772
quadrupole: 8.5743 -8.0516 -0.5226 1.2726 5.7442 2.2772
hfenergy: -763.4494883 hartree
pointgroup: C01 [X(C5H11O3P1)]
dipole: 0.1979101 0.2786687 -0.4353612 debye
dipolederiv: 1.8534326 -0.1187518 0.0322244 -0.2815665 0.8208828 -0.1020779 -0.2226647 -0.0638349 0.9606165 -1.6957888 0.1114535 0.1486698 0.1952615 -0.4665456 0.0198293 0.6398887 -0.0781186 -0.5195786 -1.0498639 -0.1014353 -0.1020636 -0.0318202 -0.4636165 0.1063939 -0.4031914 -0.0137833 -0.5440998 -0.8286662 0.1071969 -0.1415153 0.1152349 -0.5657117 0.0202651 -0.3222635 0.2344186 -0.6956947 1.2358708 -0.0636439 -0.1162031 0.1490138 0.4055992 -0.0477722 0.1255998 -0.0631834 0.2867338 0.6027389 -0.0478151 0.0461696 -0.3461396 0.1294945 -0.0558127 0.1688799 0.0462101 0.3008502 0.3487876 -0.0447461 0.0370702 0.1087124 0.0895932 0.1396184 0.1241602 -0.0570607 0.421841 -0.1042379 0.0661485 0.0596473 0.0566917 -0.0936438 -0.0421373 0.0347449 -0.0370913 0.0399716 -0.0823177 0.005834 0.0425989 -0.0801788 -0.1785624 0.06453 0.0105214 0.0631265 0.0269075 -0.0372694 0.007642 0.0227301 -0.0280391 0.0092686 -0.0037864 -0.0875436 0.0118963 -0.1895965 -0.1801026 0.0231201 0.04775 0.1080574 0.0467582 0.0036929 0.0931111 0.0003463 -0.0061733 0.003634 -0.0167937 -0.0506603 -0.0240766 0.0410403 -0.0918633 -0.1146827 -0.0979357 -0.0503606 -0.0199749 -0.0127555 0.1124629 -0.0203246 0.0627178 -0.0643012 0.0275112 0.0039686 -0.0995743 -0.0096532 0.1083533 -0.067688 0.100473 0.0026596 0.0473236 -0.0667543 0.0461596 0.0526195 -0.2079743 0.0000417 -0.021744 -0.0231594 0.0794343 -0.0260786 -0.0293221 -0.0201472 0.088369 0.1046455 -0.0674624 0.0346432 -0.0353424 -0.111037 0.0691832 0.0294994 0.0878571 0.0529634 0.1045716 0.0021681 -0.0593686 0.0170411 0.0860924 0.0259549 -0.0154726 -0.0279826 -0.1280425 -0.1956791 -0.0650712 -0.0305855 -0.0681641 0.0885082 0.0175366 -0.0335932 0.0052685 0.0894482 0.0496656 0.1113609 0.060547 0.0920075 -0.053943 -0.0451938 0.0620379 -0.066595 0.0414335 0.1081814 -0.0048442 -0.0546851 -0.0036822 0.0710109 -0.0353046 -0.0204664 0.0264807 -0.1286338 unknown
polarizability: 112.5800139|-4.5554761|76.1582104|2.2545594|-1.7167695|72.5372794 unknown
InChI: InChI=1S/C5H11O3P/c1-5(2)8-9-6-3-4-7-9/h5H,3-4H2,1-2H3
charge 0 multiplicity 1
20 atoms
P  -0.548192 0.12527 1.401883
O  0.645801 -0.36079 0.187569
O  -1.830844 -0.931989 0.780086
O  -1.292779 1.56268 0.644566
C  2.090424 -0.09001 0.470472
C  -2.775636 -0.195802 -0.107435
C  -2.076856 1.111887 -0.540458
C  2.864762 -1.26259 -0.141375
C  2.475026 1.274317 -0.124443
H  2.241062 -0.072698 1.572697
H  -3.695352 0.007105 0.471156
H  -2.996354 -0.856991 -0.961195
H  -1.384847 0.940631 -1.385193
H  -2.785722 1.920943 -0.774227
H  3.950732 -1.138635 0.026117
H  2.54256 -2.218093 0.305928
H  2.680118 -1.309951 -1.229042
H  3.547622 1.482788 0.047123
H  1.881897 2.088848 0.327991
H  2.28838 1.277181 -1.213119
