program: Gaussian 09
title: 000142495
version: EM64L-G09RevD.01
frameworkgroup: C1[X(C10H15N)]
method: RPBEPBE
basis: SDD
operation: Freq
keyword: #pfreq=noraman
keyword: PBEPBE/SDD
title: #p freq=noraman PBEPBE/SDD
converged: YES YES NO NO
title: Mulliken charges:
elementType: N C C C C C C C C C C H H H H H H H H H H H H H H H
charge: -0.696919 0.410573 0.112852 -0.565791 0.350757 0.477304 -0.620409 -0.607995 -0.681437 -0.859670 -0.824406 0.189444 0.223206 0.229598 0.228072 0.229322 0.212311 0.220287 0.219658 0.224344 0.236818 0.219026 0.218809 0.227438 0.309486 0.317325
chargesum: 0.00000
title: Mulliken charges with hydrogens summed into heavy atoms:
elementType: N C C C C C C C C C C
charge: -0.070108 0.410573 0.112852 -0.153142 0.350757 0.477304 -0.390811 -0.379923 -0.019518 -0.178850 -0.159133
polarizability: 1.43390594e+02 -5.46789438e+00 1.34460684e+02 5.38638428e+00 2.16710395e+00 7.04654469e+01
1716.lowfreq: -16.4095 -10.4234 -3.8538 -0.0006 -0.0001 0.0005 9.6808 82.4067 94.2852
frequency: -15.6313 82.3868 94.2808 147.4203 185.7731 195.1462 202.2417 264.2631 268.7697 282.5963 304.0681 344.5481 360.8544 373.4621 451.1936 485.9343 526.0212 554.8844 563.7092 600.5006 750.1662 759.8011 802.6130 870.0120 873.9310 898.4831 942.0285 972.5015 1007.3788 1013.2387 1039.3508 1046.0720 1051.8472 1063.6915 1125.9342 1165.5824 1234.5497 1265.8583 1281.4859 1307.7965 1339.5860 1379.6743 1387.1329 1395.3590 1396.3563 1427.7128 1465.5180 1470.6962 1472.8155 1473.5163 1479.6758 1483.1684 1495.4623 1506.6014 1598.0194 1624.0341 1642.3060 2945.1702 2949.6805 2964.0030 2978.3021 3010.7451 3027.7070 3042.5277 3073.0477 3073.1742 3080.8522 3082.6438 3101.6116 3107.5205 3579.6544 3717.4400
redmass: 1.0139 2.5149 2.9881 2.9582 1.3415 1.1427 1.7456 2.0312 1.4515 2.5233 2.3547 2.5546 1.2019 3.1115 5.1411 3.0100 3.4237 3.8422 3.1612 3.2823 2.6362 3.6548 1.4370 1.3730 2.4282 1.3458 2.8985 1.9546 1.6256 1.4832 1.5058 1.5438 1.7714 1.6995 1.9066 1.6887 1.3441 1.5476 1.8229 1.5678 4.2392 2.7077 1.2969 1.4530 1.2686 2.9080 1.3550 1.1038 1.0538 1.0473 1.1183 1.1341 1.1222 1.9758 6.8815 2.2873 1.6952 1.0398 1.0670 1.0389 1.0354 1.0973 1.0934 1.0945 1.0997 1.0995 1.0950 1.1003 1.0908 1.0914 1.0446 1.1032
irintensity: 0.5928 1.4902 0.1771 2.6547 0.8284 0.1622 0.5553 81.0212 179.5638 0.0908 4.8578 2.6420 1.6138 0.3086 0.4698 0.1190 1.2651 2.5689 2.5569 1.5641 2.4824 5.1275 5.9620 20.7699 1.3191 0.9056 4.8911 3.6884 11.0993 6.2903 2.3538 20.9805 20.1002 1.4806 2.7527 9.5992 1.7322 5.2784 7.6011 10.8533 20.2581 1.3066 12.9227 11.9980 2.8853 8.2344 39.0382 2.4690 10.8437 14.2326 5.7662 6.1317 24.5420 100.8238 0.0658 24.7687 138.4257 54.9578 51.5659 60.9526 44.9705 30.2283 12.4940 28.7635 16.0605 58.8639 13.7686 34.1203 34.4643 18.2506 38.7444 21.0706
temp: 298.150 k
press: 1.00000 atm
elementType: 7 6 6 6 6 6 6 6 6 6 6 1 1 1 1 1 1 1 1 1 1 1 1 1 1 1
symmnumber: 1
zpe: 589352.8 jmol-1
zpe.correction: 0.224473 hartree
zpe.thermalcorrener: 0.236152 hartree
zpe.thermalcorrenthalpy: 0.237096 hartree
zpe.thermalcorrgfe: 0.187934 hartree
zpe.sumelectzpe: -443.992752 hartree
zpe.sumelectthermal: -443.981073 hartree
zpe.sumelectthermalent: -443.980129 hartree
zpe.sumelectthermalfe: -444.029291 hartree
dipole: -1.3940 1.2459 -0.1532
dipole: 1.8759
quadrupole: -60.8026 -59.2699 -72.0274
quadrupole: -1.8314 2.3049 -0.0938
quadrupole: 3.2307 4.7634 -7.9941 -1.8314 2.3049 -0.0938
hfenergy: -444.2172247 hartree
pointgroup: C01 [X(C10H15N1)]
dipole: 0.5032628 0.5385558 0.0368861 debye
dipolederiv: -0.7944225 -0.5948962 0.0387872 -0.5948147 -0.7882758 -0.0639266 0.1186592 -0.0345184 -0.6671617 0.0866851 0.0078675 0.006018 -0.4040948 -0.1380073 -0.036488 0.0501329 0.0072477 -0.1181934 0.5388256 0.7490857 0.0068127 0.7549766 0.5419862 0.0488168 -0.0149893 0.0570065 0.0530024 0.0741902 -0.0140546 0.0342583 -0.0175396 0.1406548 0.0273544 0.099574 -0.0107 0.1348247 -0.1384535 -0.396558 0.0134195 -0.0039451 0.1500217 -0.0171758 -0.0240847 -0.0794994 -0.0605053 -0.0354006 0.2002827 -0.0006397 0.2266951 -0.0206469 0.0213102 0.0517777 0.0895106 -0.0516106 0.0816155 -0.1165503 0.0518173 0.0828762 0.0081321 -0.0103063 0.0216997 -0.0311103 -0.1848975 -0.0009782 0.0685914 0.0394865 -0.1276278 0.0675438 -0.0354313 0.0430487 -0.0295434 -0.1900134 -0.0050506 0.0205859 0.0436832 0.021768 0.0509074 -0.0112548 -0.0123769 0.0265506 -0.0210648 0.0524618 0.0164191 -0.0029455 0.0054636 -0.0601198 0.0202543 -0.0012843 0.025197 0.1028777 0.0256217 -0.0518156 -0.0013635 -0.0627872 0.0165724 0.0009744 -0.0683189 -0.0579423 0.0904162 -0.067862 -0.0221964 -0.065769 -0.0976475 -0.0150289 -0.1487566 -0.0644606 -0.0785498 -0.0640528 0.0472997 -0.0236656 0.0305798 0.0600521 -0.122727 0.118439 0.0088481 0.0686767 0.0180795 0.0731199 0.0640603 -0.0182026 0.0539812 -0.1225419 0.033277 -0.0147671 0.0402925 0.1292074 -0.1270067 0.0570563 -0.0376787 0.0684188 0.0675648 0.018673 -0.0361641 0.0171863 0.1364241 0.0675978 -0.0915873 -0.0652236 -0.0373721 -0.0131248 -0.11578 -0.0219126 -0.0808568 -0.0271976 -0.2559786 0.0961361 -0.0023387 0.0834699 0.079858 0.0050782 -0.0099883 0.0017829 0.0612233 0.1135031 0.0144972 -0.0025356 -0.0375827 -0.0990321 0.1201323 -0.0104215 0.0666576 0.0255878 0.0793913 -0.0606563 -0.0794313 0.0131502 -0.0838135 -0.0754639 -0.032799 -0.1393302 -0.0595785 0.0459229 -0.0709482 0.1170852 0.0024538 -0.0406047 0.0721118 0.0604961 0.1183625 -0.056103 -0.1398133 0.0914774 -0.038536 -0.0276643 0.0875654 -0.0020132 -0.0296079 0.0132865 0.1027058 0.0542359 0.0667853 -0.0612229 -0.0230636 -0.0957854 0.1001582 0.0008453 0.1331687 0.0236903 -0.1402375 -0.0019409 0.0672105 0.1015329 0.0397765 -0.0426936 0.0814019 -0.0028958 0.0769553 0.0257976 -0.0823424 -0.0227573 -0.0991299 -0.0007056 -0.0697428 -0.085762 -0.128887 -0.1188087 0.1512072 0.0405758 -0.0340668 0.01843 0.1943726 0.0307018 -0.0704107 0.0234323 0.3272562 0.1877284 0.0337909 -0.0164471 0.0400007 0.155458 0.0117518 -0.0391357 -0.0145249 0.3369369 unknown
polarizability: 142.4800055|6.2938984|135.3287987|4.4313955|-3.7966081|70.507921 unknown
InChI: InChI=1S/C10H15N/c1-4-9-6-7(2)5-8(3)10(9)11/h5-6H,4,11H2,1-3H3
charge 0 multiplicity 1
26 atoms
N  1.486136 1.879436 0.140968
C  0.845302 -0.493181 0.292173
C  0.497207 0.88278 0.112192
C  2.295869 -0.914313 0.490108
C  -0.869102 1.25028 -0.099185
C  -1.539993 -1.131114 0.046649
C  -0.180772 -1.464821 0.260594
C  -1.854916 0.239179 -0.126642
C  3.114376 -0.927925 -0.831982
C  -1.243809 2.709991 -0.284318
C  -2.617112 -2.202198 -0.015217
H  2.800834 -0.254472 1.228206
H  2.321502 -1.927972 0.931622
H  0.094481 -2.518108 0.408796
H  -2.901123 0.532211 -0.287572
H  2.68656 -1.660608 -1.539099
H  4.169391 -1.203319 -0.645863
H  3.096566 0.058225 -1.330977
H  -0.969993 3.325155 0.598174
H  -0.741912 3.157235 -1.166953
H  -2.330712 2.822523 -0.433717
H  -2.351914 -3.078401 0.603769
H  -3.590099 -1.819237 0.342511
H  -2.770562 -2.567636 -1.050279
H  2.453645 1.645424 0.335487
H  1.233052 2.859968 0.080955
