program: Gaussian 09
title: 000010387
version: EM64L-G09RevD.01
frameworkgroup: C1[X(C8H7ClO2)]
method: RPBEPBE
basis: SDD
operation: Freq
keyword: #p
keyword: freq=noraman
keyword: PBEPBE/SDD
title: #p freq=noraman PBEPBE/SDD
converged: NO NO NO NO
title: Mulliken charges:
elementType: Cl O O C C C C C C C C H H H H H H H
charge: -0.035939 -0.189036 -0.159488 0.476129 -0.458654 -0.370201 -0.370142 -0.219940 -0.219946 -0.224909 0.105525 0.247852 0.247853 0.235163 0.235152 0.232925 0.232932 0.234726
chargesum: 0.00000
title: Mulliken charges with hydrogens summed into heavy atoms:
elementType: Cl O O C C C C C C C C
charge: -0.035939 -0.189036 -0.159488 0.476129 0.037050 -0.135039 -0.134990 0.012984 0.012986 0.009817 0.105525
polarizability: 1.40671829e+02 -9.18814019e+00 7.53972141e+01 -6.15569264e-03 -8.21592235e-03 8.66154780e+01
1716.lowfreq: -0.0018 -0.0015 0.0007 7.4607 11.9449 27.1499 31.0147 38.1242 68.8269
frequency: 29.4232 38.0503 68.8203 138.5993 180.8773 233.4132 325.7884 365.5516 403.7752 414.7353 501.9462 566.4141 615.9900 617.1268 701.9613 746.9842 753.4345 825.2691 852.4416 855.7864 934.7817 944.8659 980.7214 989.8522 1002.6402 1025.7786 1037.1158 1089.5228 1175.4525 1186.5802 1189.2666 1229.1734 1327.5792 1341.8874 1383.9497 1441.3208 1467.9214 1486.4972 1593.2745 1614.6629 1683.7435 3018.5065 3089.1868 3120.5802 3121.5344 3134.0749 3148.4301 3163.6931
redmass: 4.3117 8.3137 7.3529 6.0965 7.8416 7.1653 2.1886 6.0361 2.7909 19.6880 3.9432 5.1203 10.9234 6.6768 1.8704 8.3282 2.0019 5.6920 3.9776 1.2475 1.5125 1.6235 1.3931 6.2007 1.3283 2.1869 11.1563 1.5250 1.0567 1.0797 1.1156 2.3811 1.2738 1.3774 8.6672 2.1850 1.1073 2.4106 6.0441 6.1129 11.9994 1.0576 1.1092 1.0862 1.0889 1.0916 1.0961 1.1016
irintensity: 0.2219 0.9865 0.1111 1.4247 3.9648 11.9577 1.4007 10.5249 0.0058 13.0019 34.9603 23.3832 7.2375 2.0984 37.7181 77.3300 95.8000 33.8501 10.0715 0.0004 0.0697 1.6681 0.0140 4.0842 0.0220 7.9106 740.2000 6.8585 0.0138 1.9953 0.0032 10.7906 0.2472 53.7089 1.0902 10.5405 6.0150 2.9028 0.6848 1.9904 385.4697 14.7885 8.9615 4.7702 3.3144 10.5578 32.9923 17.6556
temp: 298.150 k
press: 1.00000 atm
elementType: 17 8 8 6 6 6 6 6 6 6 6 1 1 1 1 1 1 1
symmnumber: 1
zpe: 341886.6 jmol-1
zpe.correction: 0.130218 hartree
zpe.thermalcorrener: 0.140309 hartree
zpe.thermalcorrenthalpy: 0.141253 hartree
zpe.thermalcorrgfe: 0.092038 hartree
zpe.sumelectzpe: -918.756969 hartree
zpe.sumelectthermal: -918.746878 hartree
zpe.sumelectthermalent: -918.745934 hartree
zpe.sumelectthermalfe: -918.795149 hartree
dipole: 4.3637 0.5893 0.0003
dipole: 4.4033
quadrupole: -74.0484 -74.5068 -62.7589
quadrupole: -0.8081 -0.0001 -0.0057
quadrupole: -3.6104 -4.0688 7.6792 -0.8081 -0.0001 -0.0057
hfenergy: -918.8871871 hartree
pointgroup: C01[X(C8H7Cl1O2)]
dipole: -1.6919106 0.0005979 0.37239 debye
dipolederiv: -0.5702501 0.0005154 0.3267152 0.0006991 -0.0864794 -0.0008729 0.5507413 -0.0010394 -0.7388632 -2.0720054 0.0003376 0.2392117 0.0007276 -0.212992 -0.0005114 0.2485109 -0.0004798 -0.4938765 -0.81749 -0.0001862 -0.1377945 -0.0007049 -0.2502617 -0.0016017 -0.3081217 -0.001229 -1.0569414 -0.1564957 0.0000056 0.0132437 -0.0002673 -0.0125561 -0.0002105 -0.1307473 -0.0001935 -0.1164894 1.2851603 -0.0001321 -0.0785932 -0.0008564 0.312454 0.00022 -0.4923195 0.000202 0.4245071 -0.0079863 0.1052063 0.0417018 -0.0364686 0.0438398 0.0167292 0.0428331 0.0199272 -0.1231387 -0.0079465 -0.1050754 0.0420645 0.036577 0.0437057 -0.017317 0.0426428 -0.0205224 -0.1230037 -0.0905812 -0.1189219 0.0291319 -0.1338737 0.0676992 -0.0278603 0.0264892 -0.0423 -0.1293175 -0.090635 0.1189958 0.0287058 0.1339419 0.0679845 0.0271532 0.0260026 0.0415881 -0.1295729 0.0859152 0.0001724 0.0938846 0.0001408 -0.0243387 -0.0001472 0.082822 -0.0001442 -0.1122107 2.4381129 -0.0004824 -0.3333004 0.0001702 0.2341402 0.0028212 -0.0191058 0.0025836 1.8857394 -0.0404484 -0.0265982 -0.0084269 -0.0548464 -0.0370754 -0.0901726 0.0950848 -0.0345977 0.0144099 -0.0404503 0.0265816 -0.0085878 0.0551914 -0.0365655 0.0903744 0.0948869 0.0347968 0.0139304 0.0519407 -0.0960562 -0.0452369 -0.0822504 -0.0382607 -0.0232843 -0.0404935 -0.0330401 0.1310424 0.0519131 0.0959109 -0.0455816 0.0821279 -0.0380324 0.023877 -0.0407987 0.0336442 0.1308284 0.0374879 0.0794179 -0.0370682 0.094445 -0.0613604 0.0273611 -0.0455031 0.0259123 0.1461492 0.0375202 -0.0795298 -0.0367794 -0.0945855 -0.0615705 -0.0266249 -0.0451478 -0.0251722 0.1463433 -0.0937614 -0.0001615 -0.0832902 -0.0001677 0.0896696 0.0000667 -0.0877761 0.0000638 0.1304641 unknown
polarizability: 141.7371134|0.0100914|86.6154358|3.7082336|-0.0243739|74.331972 unknown
InChI: InChI=1S/C8H7ClO2/c9-8(10)11-6-7-4-2-1-3-5-7/h1-5H,6H2
charge 0 multiplicity 1
18 atoms
Cl 3.841555 -0.002505 -1.626244
O  1.585945 -0.000605 -0.297177
O  3.484756 0.001965 1.089697
C  -0.741194 0.000876 0.44613
C  0.679962 0.001863 0.937646
C  -1.419719 1.22446 0.208456
C  -1.41951 -1.223657 0.212769
C  -2.752168 1.224759 -0.260248
C  -2.751958 -1.225873 -0.255917
C  -3.420852 -0.001033 -0.4928
C  2.925162 -0.00025 -0.009892
H  0.937934 0.90364 1.520492
H  0.937968 -0.897579 1.52408
H  -0.899866 2.174503 0.385589
H  -0.899462 -2.172974 0.393288
H  -3.267972 2.17454 -0.441141
H  -3.267591 -2.176378 -0.433401
H  -4.455989 -0.00175 -0.853527
