program: Gaussian 09
title: 000142436
version: EM64L-G09RevD.01
frameworkgroup: C1[X(C11H11NO2)]
method: RPBEPBE
basis: SDD
operation: Freq
keyword: #p
keyword: freq=noraman
keyword: PBEPBE/SDD
title: #p freq=noraman PBEPBE/SDD
converged: YES YES NO NO
title: Mulliken charges:
elementType: O O N C C C C C C C C C C C H H H H H H H H H H H
charge: -0.298552 -0.259088 -0.052398 0.240605 -0.061920 0.319773 -0.361978 -0.444269 -0.309522 0.102563 -0.257257 -0.221261 -0.523274 -0.512969 0.254607 0.271503 0.257745 0.229233 0.230015 0.238696 0.227647 0.227166 0.237900 0.228474 0.236562
chargesum: 0.00000
title: Mulliken charges with hydrogens summed into heavy atoms:
elementType: O O N C C C C C C C C C C C
charge: -0.298552 -0.259088 -0.052398 0.240605 -0.061920 0.319773 -0.107371 -0.172766 -0.051777 0.102563 -0.028024 0.008754 0.170234 0.189968
polarizability: 1.90176363e+02 -1.43559971e+01 1.56246624e+02 -1.31739402e+00 -5.06908538e+00 6.41308005e+01
1716.lowfreq: -44.6755 -10.0107 -9.2718 -6.3183 -0.0004 -0.0003 0.0003 84.1836 103.4766
frequency: -44.2800 84.1827 103.4766 136.4176 146.7297 166.0284 177.2965 193.1759 259.0498 289.4489 326.8356 362.5034 427.3560 442.9376 500.1706 522.9162 541.2425 585.3772 650.0039 663.6611 680.6562 737.2943 777.3935 785.7286 840.4293 874.5978 884.0785 893.5645 941.8868 966.6133 993.9449 995.8787 1021.9002 1061.1014 1108.6546 1113.1405 1120.4211 1147.7615 1150.5501 1157.2002 1167.7018 1242.3046 1285.0834 1319.9614 1346.0579 1401.4668 1410.0233 1424.2885 1440.5667 1447.3309 1458.4728 1459.9457 1465.7397 1472.0348 1502.8157 1550.1254 1594.3121 1622.6659 2960.7670 2998.8653 3049.9355 3099.2673 3121.8310 3130.8984 3138.6868 3143.8229 3159.4658 3170.6550 3190.3351
redmass: 2.8976 3.3977 3.5095 1.7376 1.0663 1.6781 3.4999 4.0144 5.7054 4.7002 5.4883 4.8701 5.2054 3.9247 6.2507 7.5876 3.4870 5.0781 5.8014 3.2687 6.3079 5.3885 1.4989 2.6737 6.6096 1.5793 1.5987 6.2376 7.5030 1.3634 1.3369 4.1983 2.0763 5.0948 1.2385 1.2576 1.8859 1.3810 1.4069 1.5202 1.1621 1.8135 2.7735 3.8042 3.5913 5.0797 2.7287 1.4902 1.2781 1.0516 1.1385 1.9675 1.0781 1.0591 4.0011 7.5972 7.3389 6.9633 1.0316 1.0291 1.1045 1.1041 1.1007 1.0854 1.1048 1.0893 1.0955 1.0999 1.0936
irintensity: 5.1872 5.5337 1.0120 0.4322 0.1117 0.1554 3.9344 8.0916 2.3217 6.9568 1.1329 8.3571 10.2577 9.5926 1.2074 2.8332 3.8159 5.1769 13.6233 3.7906 0.9181 2.7403 74.7333 20.3352 2.8473 23.2620 1.1551 11.0113 20.5597 2.7747 0.8405 38.9384 8.6571 127.7730 0.1720 0.1755 53.9846 4.8245 14.5406 119.6576 15.7029 23.3186 20.0603 67.2681 154.7552 24.2081 36.8901 8.8714 16.5316 13.4687 6.9652 35.0989 38.6255 17.9012 48.2627 86.8362 215.4569 47.9616 59.6123 51.8732 37.8872 30.4449 27.2971 2.4948 27.2482 7.5317 20.3181 23.2720 0.8133
temp: 298.150 k
press: 1.00000 atm
elementType: 8 8 7 6 6 6 6 6 6 6 6 6 6 6 1 1 1 1 1 1 1 1 1 1 1
symmnumber: 1
zpe: 512043.8 jmol-1
zpe.correction: 0.195027 hartree
zpe.thermalcorrener: 0.206829 hartree
zpe.thermalcorrenthalpy: 0.207773 hartree
zpe.thermalcorrgfe: 0.157269 hartree
zpe.sumelectzpe: -629.942816 hartree
zpe.sumelectthermal: -629.931014 hartree
zpe.sumelectthermalent: -629.930070 hartree
zpe.sumelectthermalfe: -629.980574 hartree
dipole: 0.8762 0.1484 1.7262
dipole: 1.9415
quadrupole: -69.5536 -73.2196 -85.2545
quadrupole: 3.4339 1.7232 4.3064
quadrupole: 6.4556 2.7896 -9.2453 3.4339 1.7232 4.3064
hfenergy: -630.1378429 hartree
pointgroup: C01 [X(C11H11N1O2)]
dipole: 0.3287965 0.1021721 0.6818608 debye
dipolederiv: -0.5392803 -0.4015356 -0.1218105 -0.3223716 -1.2861753 -0.2289971 -0.0434989 -0.1454131 -0.4312984 -1.8533997 -0.2266152 0.0263062 -0.3074524 -0.4603904 0.0111614 0.0611776 0.0231653 -0.3182869 -0.963284 0.0095239 0.0002288 0.4510819 -0.4733311 0.0104836 -0.0465507 0.0342612 -0.2244404 -0.2763986 0.0144209 -0.0160309 0.0030669 -0.4314686 0.007877 -0.0059237 0.0516035 0.0222332 0.6169946 -0.0227108 0.0003738 -0.2442739 0.1327864 -0.0034768 0.018655 -0.0150692 0.0552155 0.7854436 0.2994657 0.0588502 0.1230399 1.2480344 0.0857092 -0.0372268 -0.1484094 -0.0240181 0.1206942 -0.0800149 0.0016022 0.0378546 0.0670167 -0.0342195 -0.0233561 -0.0533123 -0.1274544 -0.6641641 -0.2064894 -0.0061058 -0.3309958 -0.2262605 -0.0444199 0.0441829 -0.0177675 -0.1372637 -0.1580762 0.0518566 -0.0090371 0.1384176 0.0691923 -0.0357801 -0.0150005 -0.0298311 -0.1665876 1.9798981 0.1679711 -0.0193535 0.0193524 0.4507714 -0.0197625 -0.021716 -0.0516607 0.156527 0.064469 0.0568304 -0.022245 0.107165 -0.1777912 -0.0083321 -0.0316452 0.0010002 -0.1733695 -0.0271174 0.0014897 -0.0019646 -0.0746409 0.1697264 -0.0392811 0.0105162 -0.0409094 -0.1436798 0.3092694 0.1079053 0.0825983 0.0945912 0.5510153 0.1757223 0.140381 0.4259858 0.4808051 0.6271639 0.1377883 -0.0182477 0.4652213 0.3923722 -0.0167883 -0.0612107 -0.0158362 0.2729158 0.0453459 -0.0589639 0.002846 -0.1020923 -0.0146618 0.0278343 0.0155758 0.0276492 0.1457782 0.0857059 0.0634925 -0.000519 0.0529278 0.0117576 0.0206722 -0.0009889 0.0189107 0.1723697 0.0565427 -0.094079 0.0152434 -0.042413 -0.0290558 0.0229863 0.0056986 0.0255402 0.1550715 -0.1374183 0.0108716 0.01541 0.0020852 0.0844885 0.0094597 0.0153844 0.0103638 0.1598309 0.0236059 0.1020574 -0.0074084 0.1065856 -0.0744991 0.024719 -0.0104745 0.0255197 0.1550401 0.0560154 -0.1256346 0.0113856 -0.10303 -0.1063521 0.0118215 0.0232316 0.0362444 0.062476 -0.0177615 0.0501233 -0.103288 0.0999317 0.0041631 0.0792594 -0.0971342 -0.0245477 -0.0448769 -0.0785164 0.0834767 0.1193272 0.002491 0.0500403 -0.0491062 0.0370579 -0.1308784 -0.0384555 0.0669404 0.0366838 0.0636389 -0.1172429 -0.0336614 -0.07923 0.0260538 -0.0921682 -0.0448439 -0.1875098 0.0005881 0.0018461 0.0593829 0.0786369 0.0039551 -0.0032484 0.0052287 0.1208411 0.0648371 0.0214982 -0.0736464 -0.1186822 0.0036459 0.0677327 0.0000597 0.0803307 -0.084529 unknown
polarizability: 193.8004592|-8.350871|152.756156|-0.1526467|-3.9779364|63.997173 unknown
InChI: InChI=1S/C11H11NO2/c1-13-10-7-11(14-2)12-9-6-4-3-5-8(9)10/h3-7H,1-2H3
charge 0 multiplicity 1
25 atoms
O  0.750937 2.621472 -0.43814
O  -3.272633 0.016029 -0.031601
N  -1.210065 -1.129409 0.08742
C  0.898141 0.176782 -0.12486
C  0.180117 -1.067869 0.049869
C  0.106158 1.379866 -0.243554
C  2.324377 0.169794 -0.189551
C  -1.280595 1.311732 -0.214397
C  0.926078 -2.279709 0.181151
C  -1.883869 0.01761 -0.050084
C  3.029648 -1.031796 -0.059877
C  2.324797 -2.260439 0.131564
C  1.114374 3.322794 0.810513
C  -3.924935 -1.299249 0.134787
H  2.846818 1.115914 -0.365559
H  -1.904335 2.201342 -0.321521
H  0.367151 -3.21104 0.314422
H  4.123586 -1.036398 -0.114068
H  2.886573 -3.195896 0.231533
H  1.623611 4.245582 0.494519
H  1.794807 2.707396 1.430759
H  0.208261 3.572937 1.395097
H  -3.646448 -1.976443 -0.690442
H  -5.001288 -1.073714 0.119706
H  -3.626166 -1.761987 1.090713
