program: Gaussian 09
title: 000142435
version: EM64L-G09RevD.01
frameworkgroup: C1[X(C8H11NO2)]
method: RPBEPBE
basis: SDD
operation: Freq
keyword: #p
keyword: freq=noraman
keyword: PBEPBE/SDD
title: #p freq=noraman PBEPBE/SDD
converged: NO YES NO NO
title: Mulliken charges:
elementType: O O N C C C C C C C C H H H H H H H H H H H
charge: -0.304050 -0.293313 -0.206769 0.366568 0.366014 -0.457438 -0.637228 -0.447109 -0.761689 0.207989 -0.526266 0.247818 0.288168 0.233754 0.234610 0.257516 0.229817 0.230821 0.250958 0.237699 0.237549 0.244581
chargesum: 0.00000
title: Mulliken charges with hydrogens summed into heavy atoms:
elementType: O O N C C C C C C C C
charge: -0.304050 -0.293313 -0.206769 0.366568 0.366014 -0.209621 0.119304 -0.189593 -0.050093 0.207989 0.193562
polarizability: 1.16596119e+02 -2.40172253e+00 1.30413769e+02 4.08830390e-02 -5.64752990e-02 5.57571437e+01
1716.lowfreq: -57.6160 -10.2819 -0.0005 -0.0003 0.0008 3.1649 9.7684 72.7433 105.7674
frequency: -56.4956 72.7411 105.7595 161.6128 180.4902 214.8533 224.6653 253.2417 266.8229 316.3185 361.8821 404.0249 453.4084 512.1187 539.8674 553.2548 603.9446 636.1078 684.8119 752.9867 818.4597 860.7807 886.9327 943.6434 1001.9883 1030.3802 1047.4758 1114.5173 1119.1155 1125.6201 1154.9974 1189.4565 1194.9265 1227.5873 1278.5879 1353.5816 1405.5842 1423.9381 1432.8317 1452.0321 1461.5024 1463.4594 1464.8441 1476.5620 1491.4046 1494.5923 1550.9882 1555.7975 1656.3823 2979.5609 2981.7754 2997.0435 3056.1295 3074.9918 3075.9550 3114.7705 3136.8112 3152.6027 3172.6761 3188.6211
redmass: 1.0408 3.0555 3.5574 2.9935 1.7526 3.4608 1.2555 1.5692 3.6253 3.4978 2.8774 5.1356 6.3575 5.5873 3.4662 4.6137 4.0470 6.6898 2.3012 4.4248 1.4509 1.6313 4.6126 2.9198 2.4870 1.6058 1.5090 1.2922 1.2552 2.5506 1.4345 6.2499 2.1434 1.4298 3.9751 2.4279 1.2694 1.9759 1.4499 1.2541 1.1527 1.0487 1.0466 1.0721 1.2079 1.0558 7.7125 6.2407 7.4724 1.0317 1.0393 1.0373 1.0978 1.1046 1.1025 1.0966 1.1014 1.0964 1.0927 1.0918
irintensity: 0.0059 2.3544 4.7699 1.5402 4.0932 9.3720 0.2621 1.7116 2.7362 2.3142 0.7676 0.7550 14.1430 7.3179 0.1367 1.3368 11.5892 3.4414 4.4359 3.0696 23.4934 43.2635 11.9774 4.7285 15.8340 1.6590 6.2906 0.4234 0.1100 121.8987 10.9990 116.4653 42.0900 0.7908 5.7711 29.8993 4.1836 111.2049 45.5863 40.9297 32.0136 17.8377 1.3587 27.3967 54.9498 36.9453 34.9566 181.4276 414.8862 47.4315 13.9974 64.3911 13.9775 13.7242 46.4379 12.5048 18.0899 0.3534 5.1605 2.6963
temp: 298.150 k
press: 1.00000 atm
elementType: 8 8 7 6 6 6 6 6 6 6 6 1 1 1 1 1 1 1 1 1 1 1
symmnumber: 1
zpe: 465992.2 jmol-1
zpe.correction: 0.177487 hartree
zpe.thermalcorrener: 0.188046 hartree
zpe.thermalcorrenthalpy: 0.188990 hartree
zpe.thermalcorrgfe: 0.141656 hartree
zpe.sumelectzpe: -515.794395 hartree
zpe.sumelectthermal: -515.783837 hartree
zpe.sumelectthermalent: -515.782892 hartree
zpe.sumelectthermalfe: -515.830227 hartree
dipole: 2.0950 -6.9527 -0.0029
dipole: 7.2615
quadrupole: -50.0997 -79.4789 -67.0136
quadrupole: 9.6347 0.0064 0.0096
quadrupole: 15.4311 -13.9482 -1.4828 9.6347 0.0064 0.0096
hfenergy: -515.9718824 hartree
pointgroup: C01 [X(C8H11N1O2)]
dipole: 2.1198772 1.8990386 0.2480417 debye
dipolederiv: -1.5374298 0.4078498 0.0627593 0.3491694 -0.5961863 -0.0425396 0.0565399 -0.0439642 -0.3028634 -0.8774063 -0.4003053 -0.0508705 -0.4806374 -1.0066976 -0.0793519 -0.0643462 -0.0824414 -0.4059717 -0.9443374 -0.1492939 -0.0145837 0.1050908 -0.8899034 -0.1014214 0.0118846 -0.1118667 -0.1449419 0.8582413 0.2115182 0.0254179 0.0028413 0.4576935 0.0617818 -0.0010405 0.0683176 0.0077401 1.4654941 -0.2504845 -0.0433179 0.1209845 0.9906754 0.1121862 0.0075504 0.1157675 0.1714932 -0.1177116 0.0013599 -0.0006617 -0.256501 -0.7554746 -0.0705624 -0.0354552 -0.0707856 -0.2343239 0.1836777 0.2812095 0.034068 0.2148551 0.3903484 0.018798 0.0267423 0.0219038 0.2158203 -0.8761857 -0.3043764 -0.0379203 -0.2321371 -0.2755436 0.0045905 -0.0275207 0.0050307 -0.2950821 -0.0008387 0.0249959 0.0038151 0.0845525 -0.1293657 -0.029319 0.0117475 -0.0341355 0.0797873 1.1217257 0.3719583 0.0453285 0.4524447 1.1768455 0.13254 0.0566488 0.1331304 0.194409 0.4876106 -0.1778157 -0.0254579 -0.4892234 0.5137981 0.0315902 -0.0674618 0.0295617 0.3099294 -0.0542899 0.0620051 0.0091914 0.0507946 0.0552622 -0.0138354 0.0076323 -0.0138232 0.157314 -0.0169003 -0.0089669 -0.0045493 0.0586303 0.160741 0.0071805 0.0049374 0.0067729 0.1353814 0.0851914 -0.0119234 0.0671485 -0.0656045 -0.0408926 -0.0800509 0.0086148 -0.127408 -0.0771592 0.0826223 -0.0039837 -0.0636018 -0.0678737 -0.09409 0.075459 -0.0182382 0.1274343 -0.030515 0.0501556 0.0541174 0.0082208 0.0838805 -0.0126802 -0.0271841 0.0124956 -0.0270796 0.1790756 0.0845131 -0.0540724 0.085637 -0.0171482 -0.0492024 0.0627624 0.0586774 0.1103729 -0.0110937 0.0876683 -0.0255066 -0.0937605 0.0013905 -0.0018964 -0.0599261 -0.0585196 -0.1066018 -0.0626476 -0.1051609 0.0464793 0.003265 -0.0576579 0.1003496 -0.0033001 -0.0100944 -0.0020712 0.1200451 0.0802585 -0.0333535 -0.0889836 0.0956449 -0.0171007 -0.0635369 -0.0106749 -0.0819954 -0.0871398 0.0816122 -0.0558144 0.0758843 0.089458 -0.059722 0.0701659 0.0347187 0.0900983 -0.0451754 -0.1385101 0.014403 0.0029715 -0.0429539 0.0830419 -0.0060264 -0.0048382 -0.0062176 0.1259186 unknown
polarizability: 122.41398|7.2217952|123.3639777|0.5691347|9.1172084|56.9890744 unknown
InChI: InChI=1S/C8H11NO2/c1-6-4-7(10)5-8(11-3)9(6)2/h4-5H,1-3H3
charge 0 multiplicity 1
22 atoms
O  2.324345 -0.248261 -0.271814
O  -2.185678 -2.108653 -0.501028
N  0.452031 1.109599 -0.073892
C  -0.944039 1.323651 -0.041438
C  0.928659 -0.195922 -0.254799
C  -1.819342 0.264676 -0.180227
C  1.394128 2.241712 0.073611
C  0.08292 -1.27989 -0.397479
C  -1.424202 2.745763 0.153252
C  -1.374955 -1.123839 -0.367339
C  2.937596 -1.569449 -0.455595
H  -2.89637 0.450565 -0.15171
H  2.419371 1.85302 0.045781
H  1.234068 2.758315 1.035974
H  1.265864 2.967845 -0.748375
H  0.476814 -2.288296 -0.538172
H  -1.066264 3.421091 -0.646369
H  -1.091861 3.169878 1.119556
H  -2.524512 2.761075 0.139716
H  2.644955 -2.006613 -1.42786
H  2.650941 -2.252486 0.365228
H  4.020632 -1.382782 -0.433722
