program: Gaussian 09
title: 000142420
version: EM64L-G09RevD.01
frameworkgroup: C1[X(C5H3Br)]
method: RPBEPBE
basis: SDD
operation: Freq
keyword: #pfreq=noraman
keyword: PBEPBE/SDD
title: #p freq=noraman PBEPBE/SDD
converged: NO YES NO YES
title: Mulliken charges:
elementType: Br C C C C C H H H
charge: 0.122513 -0.748788 0.065430 -0.061190 0.300492 -0.445763 0.255765 0.255774 0.255767
chargesum: 0.00000
title: Mulliken charges with hydrogens summed into heavy atoms:
elementType: Br C C C C C
charge: 0.122513 0.018518 0.065430 -0.061190 0.300492 -0.445763
polarizability: 1.44948436e+02 -2.00098824e+01 3.23133102e+01 -5.10578815e+01 8.80031570e+00 5.13207198e+01
1716.lowfreq: -11.7214 -0.0007 -0.0005 -0.0001 3.8010 4.4693 81.9946 82.3895 214.4296
frequency: 81.9938 82.3860 214.4295 214.6559 332.4714 332.6293 346.9880 483.1683 483.2690 793.2115 1024.9496 1025.1149 1238.7516 1399.4261 1455.4932 1455.5552 2163.0159 2299.2134 2972.6815 3062.4863 3062.6584
redmass: 5.5693 5.5910 5.9460 5.9455 6.1109 6.0954 9.3187 10.6993 10.7022 6.1315 1.3890 1.3886 7.4045 1.2343 1.0408 1.0408 11.8736 11.8737 1.0348 1.0983 1.0983
irintensity: 5.4646 5.4495 0.0073 0.0075 10.0712 10.0813 2.4041 0.9390 0.9408 13.2970 5.9555 5.9566 1.8265 0.0552 15.3714 15.3763 30.3671 0.0130 30.7276 10.1619 10.1608
temp: 298.150 k
press: 1.00000 atm
elementType: 35 6 6 6 6 6 1 1 1
symmnumber: 1
zpe: 146689.4 jmol-1
zpe.correction: 0.055871 hartree
zpe.thermalcorrener: 0.063100 hartree
zpe.thermalcorrenthalpy: 0.064045 hartree
zpe.thermalcorrgfe: 0.023928 hartree
zpe.sumelectzpe: -205.241506 hartree
zpe.sumelectthermal: -205.234277 hartree
zpe.sumelectthermalent: -205.233333 hartree
zpe.sumelectthermalfe: -205.273449 hartree
dipole: -1.4233 0.2456 0.6274
dipole: 1.5747
quadrupole: -26.2369 -43.8503 -40.8770
quadrupole: -3.1300 -7.9860 1.3769
quadrupole: 10.7511 -6.8622 -3.8889 -3.1300 -7.9860 1.3769
hfenergy: -205.2973772 hartree
pointgroup: C01 [X(C5H3Br1)]
dipole: -0.6195271 -0.0004393 0.000097 debye
dipolederiv: -0.5457742 0.0001987 -0.0000213 0.0005981 0.1797193 0.0000052 -0.0000373 0.0000039 0.1797081 -0.0584609 -0.0000016 -0.0000102 -0.0000552 0.0786743 -0.0000072 0.0001614 -0.0000178 0.078651 0.2884802 0.0001575 -0.0000409 0.0000796 -0.1236344 -0.0000027 -0.0000718 -0.0000045 -0.1236028 -0.1398462 -0.0001206 0.0000165 -0.0003119 -0.0642681 -0.0000054 0.0001029 -0.000007 -0.0642726 -0.0615691 0.0003152 -0.0000623 0.0007077 0.1099557 0.0000068 -0.0001284 0.0000066 0.1099623 0.6405209 -0.000539 0.0000966 -0.0010242 -0.2960204 -0.0000073 0.0000908 -0.0000048 -0.2960127 -0.0410476 -0.0369967 -0.0417558 -0.0649579 0.0505819 -0.0986519 -0.0733092 -0.0986706 0.026461 -0.0410824 -0.0177213 0.0529353 -0.0310919 0.1179485 0.0597863 0.0927852 0.0598051 -0.040885 -0.0412205 0.054708 -0.0111579 0.0960557 -0.0529569 0.0388763 -0.0195936 0.038889 0.1299908 unknown
polarizability: 170.8544725|-0.0148997|28.8638611|0.0024867|0.0006516|28.8641326 unknown
InChI: InChI=1S/C5H3Br/c1-2-3-4-5-6/h1H3
charge 0 multiplicity 1
9 atoms
Br 3.712926 -0.000653 0.000042
C  -3.440375 -0.000374 0.000145
C  -1.974657 -0.000075 0.000011
C  -0.733515 0.000334 -0.000049
C  0.638251 0.000566 -0.000091
C  1.878252 0.000271 -0.00005
H  -3.837691 -0.684441 -0.772602
H  -3.83768 -0.327607 0.978921
H  -3.838011 1.010779 -0.205828
