program: Gaussian 09
title: 000142410
version: EM64L-G09RevD.01
frameworkgroup: C1[X(C8H10)]
method: RPBEPBE
basis: SDD
operation: Freq
keyword: #p
keyword: freq=noraman
keyword: PBEPBE/SDD
title: #p freq=noraman PBEPBE/SDD
converged: NO YES NO NO
title: Mulliken charges:
elementType: C C C C C C C C H H H H H H H H H H
charge: -0.327246 -0.327170 -0.458939 -0.458884 0.336671 0.336610 -0.719981 -0.719964 0.257396 0.257415 0.232452 0.218604 0.218537 0.232450 0.235972 0.225050 0.235973 0.225055
chargesum: 0.00000
title: Mulliken charges with hydrogens summed into heavy atoms:
elementType: C C C C C C C C
charge: -0.069850 -0.069756 -0.007883 -0.007897 0.336671 0.336610 -0.258959 -0.258936
polarizability: 9.26180007e+01 1.14540804e-02 1.01646168e+02 6.15596933e+00 -6.81398753e-03 5.54381275e+01
1716.lowfreq: -0.0006 -0.0006 -0.0006 11.7308 13.6812 16.5834 64.6633 185.4999 188.5468
frequency: 64.4417 185.4998 188.5466 248.9426 372.6028 403.7829 554.4936 629.9671 661.7113 708.0727 749.5499 764.9135 787.6300 814.1815 819.7951 875.2680 926.5810 930.5813 953.7648 955.3426 996.1469 1021.6422 1083.1455 1097.0277 1147.9397 1163.3878 1193.7373 1208.9563 1228.0242 1230.9465 1246.6051 1262.5201 1408.8710 1431.4803 1453.0973 1466.0985 1661.6834 1684.8724 3013.1196 3023.9478 3059.1041 3076.3410 3078.0196 3088.0048 3088.7454 3101.9510 3190.4106 3192.7814
redmass: 2.5823 3.1919 1.9514 2.4796 2.4053 2.6632 2.4281 2.7592 1.4115 1.3506 1.4539 2.1482 1.7737 1.7662 3.2199 1.7507 1.3866 1.3500 2.1072 2.7272 2.1724 1.7516 1.5899 1.6972 1.6291 1.6446 1.3576 1.4550 1.5119 1.7490 1.4856 2.1005 1.1806 1.1634 1.0820 1.1015 6.1094 7.1248 1.0571 1.0622 1.0900 1.0943 1.1051 1.0624 1.0609 1.1060 1.1142 1.1143
irintensity: 0.0059 3.4049 0.0008 0.9019 0.0726 4.7184 1.6409 0.3469 0.9286 3.5800 0.0025 1.3118 4.8588 6.8305 0.0162 0.3798 0.0198 152.4855 3.5615 3.6294 1.5918 0.0870 3.1865 5.6087 3.3023 0.9082 0.4458 1.5309 2.2122 6.7721 0.5931 8.8147 6.8543 11.1636 6.8268 6.8290 10.4185 10.9846 34.9164 63.5526 22.0390 18.7723 1.3719 4.3778 8.5981 77.3298 9.7710 14.0628
temp: 298.150 k
press: 1.00000 atm
elementType: 6 6 6 6 6 6 6 6 1 1 1 1 1 1 1 1 1 1
symmnumber: 1
zpe: 397724.1 jmol-1
zpe.correction: 0.151485 hartree
zpe.thermalcorrener: 0.158926 hartree
zpe.thermalcorrenthalpy: 0.159870 hartree
zpe.thermalcorrgfe: 0.119745 hartree
zpe.sumelectzpe: -310.157966 hartree
zpe.sumelectthermal: -310.150525 hartree
zpe.sumelectthermalent: -310.149581 hartree
zpe.sumelectthermalfe: -310.189706 hartree
dipole: 0.6655 -0.0003 0.0819
dipole: 0.6705
quadrupole: -46.1492 -46.2651 -50.1834
quadrupole: -0.0009 2.3115 -0.0015
quadrupole: 1.3834 1.2675 -2.6508 -0.0009 2.3115 -0.0015
hfenergy: -310.3094509 hartree
pointgroup: C01 [X(C8H10)]
dipole: -0.2613446 0.0001868 0.0359834 debye
dipolederiv: -0.0840239 -0.0543088 0.0143059 -0.00788 0.0249445 0.0718873 -0.0438561 0.0405768 0.1409627 -0.0839268 0.0543377 0.0144457 0.0078601 0.0248365 -0.0717819 -0.0437016 -0.0404206 0.1411731 0.0596097 -0.0691202 -0.0625206 -0.0103558 0.035146 -0.0209832 0.0025911 -0.0200905 0.0641121 0.0597584 0.0688994 -0.0625469 0.010289 0.0350854 0.0213193 0.002604 0.0201914 0.064239 0.2641734 -0.0538356 -0.0793505 -0.1245913 0.1321498 0.0197771 -0.0823036 -0.001235 -0.0509549 0.264155 0.0537097 -0.0794769 0.1244775 0.1318934 -0.019796 -0.0826248 0.0013632 -0.0508849 -0.174119 -0.1524618 -0.1283017 -0.1083378 -0.1488364 0.0504276 -0.1007409 0.0587793 -0.3540335 -0.1737636 0.1523718 -0.1285552 0.1082674 -0.1492898 -0.0503687 -0.1008952 -0.0588248 -0.3538759 0.0150631 -0.0004188 0.0252951 0.0071219 -0.027263 -0.1240497 0.0413529 -0.1029796 -0.0810932 0.0150946 0.0004762 0.0253879 -0.0071013 -0.02702 0.123949 0.0413934 0.1028961 -0.0813772 0.0774751 -0.0349257 0.0513346 -0.0033378 -0.0020414 0.0854772 -0.0094757 0.1085192 -0.103384 -0.1708368 0.0981804 0.0428523 0.0791631 0.0166443 -0.0202325 0.0552364 -0.0519783 0.0582585 -0.1711321 -0.0977188 0.0432468 -0.078648 0.0171545 0.0202511 0.0556688 0.0519893 0.0580092 0.0775467 0.0348159 0.0509867 0.0030782 -0.0024745 -0.0858121 -0.0099245 -0.1087611 -0.1031165 0.0876025 0.0506056 0.041409 0.0195655 -0.0854139 -0.0148518 0.0378937 -0.0220474 0.1664938 -0.0750894 0.0188855 0.0949231 0.0566117 0.0548138 -0.0255338 0.099347 -0.0042754 0.1595706 0.0875379 -0.0508544 0.0414946 -0.0198233 -0.0852788 0.0148813 0.0379654 0.0221066 0.1664388 -0.0751248 -0.0186384 0.09507 -0.0563592 0.0549497 0.0254399 0.0994698 0.0041908 0.1594623 unknown
polarizability: 92.4336356|0.0130478|101.6461622|-6.6870697|0.0012595|55.6224981 unknown
InChI: InChI=1S/C8H10/c1-5-6(2)8-4-3-7(5)8/h7-8H,1-4H2
charge 0 multiplicity 1
18 atoms
C  -0.662218 0.801224 0.641857
C  -0.66331 -0.799729 0.642677
C  -1.80124 0.788049 -0.447285
C  -1.802723 -0.786254 -0.44595
C  0.770232 0.749436 0.081034
C  0.769063 -0.750384 0.081352
C  1.674208 1.704108 -0.256675
C  1.671316 -1.706616 -0.256547
H  -0.829357 1.413255 1.541079
H  -0.830755 -1.410563 1.542661
H  -1.53113 1.269224 -1.402303
H  -2.748067 1.225379 -0.087316
H  -2.750197 -1.220995 -0.084516
H  -1.534236 -1.269697 -1.400269
H  1.446024 2.770592 -0.147837
H  2.668839 1.445897 -0.639782
H  1.441475 -2.7727 -0.147261
H  2.666175 -1.450125 -0.640221
