program: Gaussian 09
title: 000142404
version: EM64L-G09RevD.01
frameworkgroup: C1[X(C9H8ClNO2S)]
method: RPBEPBE
basis: SDD
operation: Freq
keyword: #p
keyword: freq=noraman
keyword: PBEPBE/SDD
title: #p freq=noraman PBEPBE/SDD
converged: NO YES NO NO
title: Mulliken charges:
elementType: Cl S O O N C C C C C C C C C H H H H H H H H
charge: -0.017204 0.123042 -0.238454 -0.233841 0.349786 0.158182 0.456870 -0.449278 0.392671 -0.280949 -0.362548 -0.533172 -0.534562 -0.786258 0.264612 0.282535 0.223434 0.257554 0.223511 0.223421 0.223481 0.257167
chargesum: 0.00000
title: Mulliken charges with hydrogens summed into heavy atoms:
elementType: Cl S O O N C C C C C C C C C
charge: -0.017204 0.123042 -0.238454 -0.233841 0.349786 0.158182 0.456870 -0.184666 0.392671 -0.280949 -0.080013 0.171327 0.169506 -0.786258
polarizability: 2.76687961e+02 9.84142389e+00 1.45474010e+02 -3.71339922e-01 -1.48995154e-02 6.05958458e+01
1716.lowfreq: -7.0038 -4.4989 -0.0011 0.0016 0.0017 7.5764 21.6431 40.0831 70.5633
frequency: 21.5943 39.9814 70.5584 99.8309 129.7897 163.0263 176.7357 181.5472 223.8452 243.7131 248.8391 289.0109 301.1341 312.8053 368.1235 383.0524 416.7251 431.8638 464.3336 485.5500 546.5974 614.4547 669.1098 675.9220 696.1281 719.2071 826.1432 872.2427 880.8154 950.1708 984.5670 1031.9743 1110.9765 1113.2522 1152.0110 1158.7652 1173.1524 1212.2151 1252.4200 1313.4923 1354.3337 1394.8451 1432.3210 1448.5425 1466.8263 1469.4573 1471.7794 1472.2637 1500.7636 1563.3557 1605.6962 2201.5622 2963.8171 2965.0553 3055.1349 3055.5434 3134.2520 3134.8912 3178.8810 3180.7492
redmass: 11.8200 5.1958 4.7501 4.1322 5.2350 3.3537 8.3126 2.4705 2.0362 1.1543 5.7704 2.3493 10.6762 7.0228 6.6276 10.5281 11.4060 6.2888 3.7812 4.8542 8.4386 5.1410 9.1937 7.3375 6.7790 1.9747 2.1968 6.1073 1.4983 9.2617 9.3006 3.8651 1.2579 1.2581 1.3649 1.4205 2.8679 3.3267 1.3406 5.8042 6.6095 7.0028 1.1607 1.3269 1.1401 1.0502 1.0499 1.0565 2.7199 8.8712 7.3320 12.8991 1.0328 1.0330 1.1043 1.1044 1.0995 1.0995 1.0907 1.0923
irintensity: 0.5208 0.3023 1.0924 6.8287 3.3637 0.2644 3.0623 3.4424 0.0353 0.0139 3.2028 0.8155 0.4750 4.5764 3.2821 1.0210 0.1810 1.2101 4.0235 2.2858 11.7903 4.1291 0.1811 116.4459 4.7633 0.6816 42.3626 14.9261 21.3017 36.2706 73.9543 26.5366 0.0837 0.0868 8.8248 14.3202 193.6139 70.8770 24.3582 201.7466 46.9319 32.5914 32.5037 37.9330 114.6186 1.9105 29.7751 44.6969 157.3638 16.4181 36.8562 1313.5186 7.3772 117.5793 2.3179 84.6476 22.0687 8.1305 3.4102 1.9474
temp: 298.150 k
press: 1.00000 atm
elementType: 17 16 8 8 7 6 6 6 6 6 6 6 6 6 1 1 1 1 1 1 1 1
symmnumber: 1
zpe: 401082.4 jmol-1
zpe.correction: 0.152764 hartree
zpe.thermalcorrener: 0.167185 hartree
zpe.thermalcorrenthalpy: 0.168129 hartree
zpe.thermalcorrgfe: 0.109475 hartree
zpe.sumelectzpe: -1410.023050 hartree
zpe.sumelectthermal: -1410.008630 hartree
zpe.sumelectthermalent: -1410.007686 hartree
zpe.sumelectthermalfe: -1410.066339 hartree
dipole: 4.2377 5.6124 0.0040
dipole: 7.0326
quadrupole: -108.6440 -79.6944 -97.0585
quadrupole: 9.8350 0.1085 0.0614
quadrupole: -13.5117 15.4379 -1.9262 9.8350 0.1085 0.0614
hfenergy: -1410.1758146 hartree
pointgroup: C01 [X(C9H8Cl1N1O2S1)]
dipole: -1.7520472 -2.1338988 0.1794635 debye
dipolederiv: -0.3420767 0.2870382 0.0040358 0.4206224 -0.5328681 -0.00113 -0.0011503 0.0053023 -0.0365643 -1.5235256 -0.1907235 0.0738491 -0.1435305 -0.0999177 0.0073616 0.0687011 0.0092126 -0.0838849 -0.3450747 0.5954243 -0.0191694 0.2185459 -1.5208156 0.0377978 -0.0041394 0.0204295 -0.2709949 -1.9207632 -0.5172345 0.1118266 -0.4501117 -0.4158056 0.0308015 0.1131657 0.0358181 -0.2809656 -2.4903829 -0.2055464 0.1203798 -0.2256436 -0.1523246 0.0178135 0.0972127 0.0133192 0.0058793 0.2032886 -0.6744008 0.0196594 -0.4169313 1.1357325 -0.0182442 0.0129088 -0.007137 0.0983486 1.5735563 0.4388188 -0.0981003 0.4074013 0.0725779 -0.0182611 -0.0988287 -0.0216893 0.1469787 -0.3805069 0.1254893 0.0028609 0.1867964 -0.1682426 -0.0138867 -0.0012486 -0.0102727 -0.2393461 1.1675719 0.0563695 -0.063213 0.3953662 -0.1446081 -0.0148798 -0.0699498 0.0047785 0.0248305 -0.0567605 -0.4723923 0.0155792 -1.0467537 0.6364463 0.022957 0.0406654 -0.0065588 -0.1299253 0.1102789 -0.0293704 -0.0103892 0.0224093 -0.0900374 -0.0017508 -0.0110035 0.0024067 -0.0871924 0.1975341 0.2143481 -0.0018817 0.0188416 0.871058 -0.0226202 0.0056535 -0.0352651 0.3220846 0.5767864 0.1898223 -0.0218008 0.6310993 0.5307147 -0.0433482 -0.042005 -0.0198872 0.3242998 3.077641 0.3560784 -0.1471341 0.2850731 0.0003765 -0.0152529 -0.1303012 -0.0169448 -0.0683584 0.0681185 -0.0553584 0.0079593 -0.0726753 -0.0440327 0.0132304 0.0087891 0.0124378 0.1707977 0.0874189 -0.0381653 0.0066535 -0.0536054 0.0229429 0.0092268 0.0073783 0.0085745 0.171302 0.0193645 -0.1386295 0.1214945 0.0056113 -0.0211404 -0.010621 0.0895018 0.0572351 -0.0948226 -0.0154039 0.1312951 0.0026405 0.0624833 -0.0189892 0.0024558 0.0053311 -0.0011551 0.1282159 -0.0044394 -0.1545456 -0.1196139 -0.001412 -0.0247655 0.0052838 -0.0993642 -0.0457412 -0.0670614 0.063015 0.0496405 -0.0979393 -0.135223 -0.0516782 0.0924905 -0.0185977 0.1004479 -0.0828128 0.0750317 0.0446715 0.0761142 -0.1442703 -0.0682095 -0.079125 0.0129851 -0.1079105 -0.0788018 -0.1406721 -0.0126292 0.016189 0.0359068 0.0835862 -0.0002989 0.0142955 0.0025996 0.1279935 unknown
polarizability: 276.7311636|4.1014451|144.7361969|-10.9315229|-3.6668696|61.2904571 unknown
InChI: InChI=1S/C9H8ClNO2S/c1-12-8-4-9(13-2)7(11-5-14)3-6(8)10/h3-4H,1-2H3
charge 0 multiplicity 1
22 atoms
Cl -2.332481 2.88407 0.014007
S  5.135669 0.802925 -0.266713
O  1.258159 -1.952281 0.020158
O  -3.271632 0.07709 0.189198
N  2.312989 0.542543 -0.146243
C  0.358042 -0.888514 0.024991
C  -1.882654 0.12157 0.108234
C  -1.045591 -1.024646 0.109998
C  0.950114 0.411259 -0.063693
C  -1.285278 1.406227 0.01887
C  0.104831 1.550792 -0.065839
C  0.719134 -3.312755 0.107004
C  -3.914069 -1.237387 0.283955
C  3.513316 0.649473 -0.194261
H  -1.491095 -2.019312 0.177984
H  0.551206 2.54602 -0.134247
H  0.165024 -3.463586 1.053515
H  1.601117 -3.968305 0.085099
H  0.064054 -3.53895 -0.756344
H  -3.594508 -1.774404 1.197845
H  -3.7018 -1.852537 -0.611752
H  -4.990346 -1.021088 0.338335
