program: Gaussian 09
title: 000142401
version: EM64L-G09RevD.01
frameworkgroup: C1[X(C6H4O)]
method: RPBEPBE
basis: SDD
operation: Freq
keyword: #p
keyword: freq=noraman
keyword: PBEPBE/SDD
title: #p freq=noraman PBEPBE/SDD
converged: YES YES NO YES
title: Mulliken charges:
elementType: O C C C C C C H H H H
charge: -0.257124 -0.199369 -0.199651 0.234207 0.234359 -0.450033 -0.450003 0.259933 0.260055 0.283808 0.283818
chargesum: 0.00000
title: Mulliken charges with hydrogens summed into heavy atoms:
elementType: O C C C C C C
charge: -0.257124 0.060565 0.060403 0.234207 0.234359 -0.166225 -0.166185
polarizability: 1.16176255e+02 5.79706774e-03 3.77544372e+01 5.86443899e+00 -8.79499993e-04 3.82543736e+01
1716.lowfreq: -3.4433 -0.0010 -0.0007 -0.0006 3.3652 8.6169 107.8259 130.9059 208.7202
frequency: 107.8256 130.9048 208.7201 234.3821 430.7030 475.4738 492.8963 527.4641 641.1489 642.2377 671.0564 673.2205 711.6282 791.4532 946.4550 1006.0622 1049.0987 1060.3982 1202.9387 1285.1007 1365.6315 2141.9754 2148.5411 3102.4088 3108.6073 3422.8675 3423.3375
redmass: 4.3167 3.5881 4.5217 5.5666 7.7258 4.5882 7.0490 9.6282 1.2495 1.2320 1.3657 1.2519 5.8679 8.5330 3.5617 5.1863 1.2670 1.3445 1.8140 1.1559 2.1682 6.0819 6.0820 1.0904 1.0867 1.1596 1.1594
irintensity: 1.6472 0.1131 0.2209 0.9859 1.6885 17.8049 3.3474 16.7267 46.5461 88.0601 44.6096 65.5412 23.1933 59.8942 0.7598 42.0031 5.4206 10.5193 4.0591 12.5327 6.6552 0.3259 1.5324 2.3171 14.6332 143.4638 6.4825
temp: 298.150 k
press: 1.00000 atm
elementType: 8 6 6 6 6 6 6 1 1 1 1
symmnumber: 1
zpe: 191417.7 jmol-1
zpe.correction: 0.072907 hartree
zpe.thermalcorrener: 0.080043 hartree
zpe.thermalcorrenthalpy: 0.080987 hartree
zpe.thermalcorrgfe: 0.041910 hartree
zpe.sumelectzpe: -305.579673 hartree
zpe.sumelectthermal: -305.572537 hartree
zpe.sumelectthermalent: -305.571593 hartree
zpe.sumelectthermalfe: -305.610670 hartree
dipole: -0.0005 -2.2931 -0.0005
dipole: 2.2931
quadrupole: -27.8488 -45.1879 -38.1824
quadrupole: 0.0025 2.1763 0.0014
quadrupole: 9.2242 -8.1149 -1.1093 0.0025 2.1763 0.0014
hfenergy: -305.65258 hartree
pointgroup: C01 [X(C6H4O1)]
dipole: 0.0003555 -0.9021621 -0.0015174 debye
dipolederiv: -0.5335258 0.0000173 -0.0745808 -0.0005044 -0.6332746 -0.0006171 -0.0372416 -0.00041 -0.2745985 0.5209693 -0.0770784 0.0915779 -0.1786408 0.3417899 0.0130575 0.0918439 -0.0353901 0.3159654 0.5194662 0.0771422 0.0920089 0.178904 0.341626 -0.0127363 0.0931236 0.0355987 0.3155502 -0.0242675 0.0060683 -0.0186004 -0.0957131 -0.0872042 -0.0273396 0.0342529 -0.0022722 -0.140699 -0.0241879 -0.0058843 -0.0188324 0.095822 -0.0869949 0.0275414 0.0342611 0.0024655 -0.1407069 -0.4840059 0.0256321 0.0342796 0.0806019 -0.2761204 0.0070165 -0.0604815 0.0188745 -0.2642624 -0.4839203 -0.0259427 0.0343798 -0.0803336 -0.2760679 -0.0070003 -0.0604764 -0.0189765 -0.2641506 0.0030514 0.0263769 -0.0553479 0.0635536 0.0851286 -0.0339257 -0.0383263 -0.059963 -0.0331866 0.0033264 -0.0263808 -0.055422 -0.063558 0.0849083 0.034044 -0.0386184 0.0601072 -0.0326075 0.2514625 0.0075782 -0.0147031 -0.0009657 0.2531328 -0.001668 -0.0091066 -0.0027163 0.2593731 0.2516316 -0.0075286 -0.0147596 0.0008341 0.2530765 0.0016276 -0.0092307 0.002682 0.259323 unknown
polarizability: 115.9731758|0.0429668|37.7544643|7.0832849|0.0024873|38.4574258 unknown
InChI: InChI=1S/C6H4O/c1-3-5-6(4-2)7-5/h1-2,5-6H
charge 0 multiplicity 1
11 atoms
O  -0.001084 1.417923 0.001172
C  0.565161 0.101424 -0.507653
C  -0.5661 0.098909 0.506924
C  1.916711 -0.234729 -0.125415
C  -1.91715 -0.237442 0.123425
C  3.076888 -0.525737 0.175002
C  -3.076889 -0.528798 -0.178356
H  0.289316 -0.099652 -1.551082
H  -0.289779 -0.104037 1.549806
H  4.089372 -0.774815 0.437959
H  -4.088747 -0.778645 -0.442981
