program: Gaussian 09
title: 000142383
version: EM64L-G09RevD.01
frameworkgroup: C1[X(C6H10O)]
method: RPBEPBE
basis: SDD
operation: Freq
keyword: #pfreq=noraman
keyword: PBEPBE/SDD
title: #p freq=noraman PBEPBE/SDD
converged: YES YES NO NO
title: Mulliken charges:
elementType: O C C C C C C H H H H H H H H H H
charge: -0.274973 -0.036898 -0.463074 -0.463780 -0.239144 -0.202683 -0.513182 0.189850 0.215995 0.232871 0.218815 0.220217 0.248508 0.231907 0.196579 0.232790 0.206201
chargesum: 0.00000
title: Mulliken charges with hydrogens summed into heavy atoms:
elementType: O C C C C C C
charge: -0.274973 0.152952 -0.014208 -0.024747 0.009364 0.029224 0.122388
polarizability: 8.38811442e+01 2.52490806e+00 6.26652408e+01 -3.17891222e+00 -6.11666772e-01 4.78837046e+01
1716.lowfreq: -24.4866 -14.1340 -6.5907 -0.0007 -0.0005 -0.0002 56.1777 99.3680 191.1313
frequency: 54.3759 99.3381 191.1201 222.8762 328.9692 405.5126 468.4800 604.1886 735.7587 767.3192 819.6133 852.1372 917.7040 923.3794 953.5349 997.1178 1022.0121 1051.0324 1069.5563 1105.0781 1112.7316 1147.1497 1153.7172 1199.3772 1245.5308 1273.0726 1295.6266 1306.2744 1351.0288 1433.0514 1450.9049 1458.9092 1472.0630 1475.2121 1637.3688 2899.7129 2921.4456 2975.2476 2994.3005 3009.4573 3026.4715 3078.2250 3096.5976 3145.0057 3184.8250
redmass: 2.0783 2.6367 1.2891 1.9914 2.8320 3.2351 2.9610 2.0096 1.9143 2.7615 2.1514 1.7926 2.4284 3.5729 1.3211 2.8585 1.9117 3.4536 2.0068 1.1753 1.2598 1.3036 1.3903 1.3379 1.2392 1.3326 1.6168 1.2715 1.7679 1.1345 1.0772 1.0655 1.0934 1.0520 6.3571 1.0826 1.0349 1.0615 1.1009 1.0654 1.0956 1.1042 1.0969 1.0875 1.1060
irintensity: 0.2231 5.4501 0.8876 2.7727 2.9967 3.1130 10.0169 8.4391 28.8602 16.6606 8.0932 11.1786 9.1795 14.1186 2.8914 8.0866 14.2411 105.7812 11.0233 9.7380 1.3613 6.1427 8.4534 1.8619 2.1856 0.6460 3.8808 9.0075 31.1921 2.7053 6.7670 9.2200 8.0928 9.6941 3.1439 66.1658 89.2970 47.2633 65.3703 29.9244 32.3214 38.0048 36.4274 10.0883 20.2329
temp: 298.150 k
press: 1.00000 atm
elementType: 8 6 6 6 6 6 6 1 1 1 1 1 1 1 1 1 1
symmnumber: 1
zpe: 382400.7 jmol-1
zpe.correction: 0.145649 hartree
zpe.thermalcorrener: 0.153033 hartree
zpe.thermalcorrenthalpy: 0.153977 hartree
zpe.thermalcorrgfe: 0.113702 hartree
zpe.sumelectzpe: -309.256610 hartree
zpe.sumelectthermal: -309.249226 hartree
zpe.sumelectthermalent: -309.248282 hartree
zpe.sumelectthermalfe: -309.288557 hartree
dipole: 0.2167 1.4866 1.1931
dipole: 1.9185
quadrupole: -38.1150 -42.4455 -44.3441
quadrupole: -2.0092 -1.9638 -0.9232
quadrupole: 3.5199 -0.8106 -2.7092 -2.0092 -1.9638 -0.9232
hfenergy: -309.4022591 hartree
pointgroup: C01[X(C6H10O1)]
dipole: -0.0788894 -0.5878017 0.4668588 debye
dipolederiv: -1.0958877 0.0520078 0.0018803 0.0534289 -0.4360918 -0.0349201 0.1544681 -0.0250985 -0.4196691 0.8545731 0.0720951 -0.0518766 0.1222371 0.246618 0.0315872 -0.2573952 0.0606708 0.5005036 -0.1049298 -0.0541168 -0.0062684 -0.1128039 -0.0673755 -0.0759839 -0.056565 -0.0777293 0.0648485 0.0202099 0.0284973 -0.030244 -0.0208408 -0.0432621 0.0162635 0.0046754 0.044793 0.2269028 -0.1468225 -0.0617592 0.075671 -0.0015355 0.0044351 0.006703 0.0849893 -0.0304604 -0.2302837 0.0354134 0.0141087 0.0603286 0.071545 0.1692272 -0.0051947 0.0535012 -0.0235926 -0.2249551 0.5854645 -0.0872482 0.0559461 -0.2183721 0.3426393 0.0414757 0.1805737 0.0315811 0.3118685 -0.1201305 -0.022096 -0.1135181 -0.0041187 0.0270463 0.0022006 -0.0198131 -0.0187604 -0.2251861 0.0318888 0.0477253 -0.0375994 0.039888 -0.0821477 0.1060542 -0.0438576 0.1306382 -0.0174941 0.022822 0.0387828 0.0675771 0.0312388 0.048542 -0.0350768 0.0845323 -0.0739078 -0.0705347 -0.0178878 -0.0299697 0.0906099 -0.0753669 0.0002436 0.054294 0.1334933 0.0985623 -0.0574699 0.0187766 -0.028893 -0.0764273 -0.068394 -0.0020073 -0.0871948 -0.117965 -0.1187121 -0.0667095 0.09584 -0.0186671 -0.0259527 0.0008366 -0.1050253 -0.0060392 -0.0467007 -0.001486 0.1703586 -0.0665129 0.103591 -0.05054 0.1014092 -0.0002227 0.021661 -0.05495 0.0254944 0.1616299 -0.0030366 0.0230318 -0.0257634 0.052622 0.0477091 -0.0397585 -0.1701216 -0.020345 -0.2130306 -0.1206507 -0.0405703 0.0909977 -0.056952 0.0726657 0.0515986 0.1182295 0.0436686 0.0350598 0.0108701 -0.0365194 -0.0248206 0.0851783 -0.2229938 -0.0476696 -0.0470947 -0.045316 0.0541612 unknown
polarizability: 83.7862763|2.7981471|62.7326303|3.3037664|0.7225053|47.9111831 unknown
InChI: InChI=1S/C6H10O/c1-7-6-4-2-3-5-6/h2,4,6H,3,5H2,1H3
charge 0 multiplicity 1
17 atoms
O  1.551983 0.490215 -0.393405
C  0.364091 0.150103 0.417309
C  -0.283904 -1.223347 0.038994
C  -1.818892 -0.956462 -0.099572
C  -0.728078 1.160386 0.131781
C  -1.912991 0.561866 -0.149998
C  2.730495 -0.287547 -0.014562
H  0.66769 0.178321 1.491115
H  -0.06378 -2.019026 0.771309
H  0.132839 -1.528915 -0.938503
H  -2.379727 -1.353434 0.770801
H  -2.2549 -1.433425 -0.997863
H  -0.535444 2.235783 0.175482
H  -2.848019 1.08918 -0.368057
H  2.977031 -0.155604 1.06194
H  3.561382 0.095582 -0.62839
H  2.599124 -1.371576 -0.217382
