program: Gaussian 09
title: 000142380
version: EM64L-G09RevD.01
frameworkgroup: C1[X(C8H10)]
method: RPBEPBE
basis: SDD
operation: Freq
keyword: #p
keyword: freq=noraman
keyword: PBEPBE/SDD
title: #p freq=noraman PBEPBE/SDD
converged: NO YES NO NO
title: Mulliken charges:
elementType: C C C C C C C C H H H H H H H H H H
charge: -0.191956 -0.192234 -0.241838 -0.241656 -0.467736 -0.467560 -0.264207 -0.264351 0.252085 0.252043 0.242330 0.242399 0.210602 0.222148 0.222248 0.210583 0.238543 0.238556
chargesum: 0.00000
title: Mulliken charges with hydrogens summed into heavy atoms:
elementType: C C C C C C C C
charge: 0.060130 0.059809 0.000492 0.000743 -0.034985 -0.034729 -0.025664 -0.025795
polarizability: 8.85879279e+01 -1.26791843e-03 7.80925448e+01 -2.69164200e+00 -8.17942296e-03 5.92235005e+01
1716.lowfreq: -0.0002 0.0004 0.0007 22.4709 25.2853 26.3763 100.8841 247.9447 283.8505
frequency: 100.7291 247.9443 283.8287 377.0217 392.3638 641.7701 718.5981 756.6618 791.4249 796.7175 826.6074 838.4230 898.3271 906.4691 915.8673 937.6564 961.8033 986.9553 1001.0951 1025.0205 1038.8015 1043.0843 1095.1462 1121.0127 1138.0943 1146.8929 1172.1800 1181.3646 1212.6466 1213.5344 1227.5959 1239.1106 1247.2388 1270.9036 1279.7055 1453.1759 1466.9716 1551.6430 2999.6751 3011.2994 3042.6539 3049.0914 3058.7748 3066.2597 3069.3071 3091.4440 3132.2724 3173.6570
redmass: 2.0554 2.8448 2.2961 2.8368 3.4040 3.4379 1.3460 1.2412 1.7266 2.9037 2.3887 1.8070 3.8082 1.8537 1.9889 1.8233 2.6808 1.8352 1.4832 1.4944 2.0362 1.8850 1.6380 1.7826 1.5520 1.7160 1.3436 1.3435 1.2861 1.6794 1.4882 1.5291 1.4649 1.5281 2.0050 1.0823 1.1050 5.5165 1.0577 1.0631 1.0865 1.0923 1.0906 1.1011 1.0975 1.1039 1.0859 1.1174
irintensity: 0.0002 0.7492 0.2457 0.8063 3.0620 2.1482 13.0271 89.9344 5.6725 0.8115 3.9114 0.2742 0.1100 5.4248 9.8278 0.2661 2.9755 4.2370 0.7738 3.3238 0.3509 0.7668 4.6100 1.3633 3.1475 5.6195 0.0431 0.5483 0.5061 2.2239 4.7949 5.1616 2.8302 0.7981 10.8459 5.9683 8.0390 3.8857 47.1131 66.2897 21.6809 36.5495 56.7488 10.3149 1.1947 95.1781 16.7277 38.0793
temp: 298.150 k
press: 1.00000 atm
elementType: 6 6 6 6 6 6 6 6 1 1 1 1 1 1 1 1 1 1
symmnumber: 1
zpe: 401938.2 jmol-1
zpe.correction: 0.153090 hartree
zpe.thermalcorrener: 0.159532 hartree
zpe.thermalcorrenthalpy: 0.160476 hartree
zpe.thermalcorrgfe: 0.122703 hartree
zpe.sumelectzpe: -310.136737 hartree
zpe.sumelectthermal: -310.130295 hartree
zpe.sumelectthermalent: -310.129351 hartree
zpe.sumelectthermalfe: -310.167124 hartree
dipole: -0.5146 0.0001 -0.1987
dipole: 0.5516
quadrupole: -48.3881 -47.1201 -48.1804
quadrupole: -0.0017 -0.9614 -0.0014
quadrupole: -0.4919 0.7761 -0.2842 -0.0017 -0.9614 -0.0014
hfenergy: -310.2898271 hartree
pointgroup: C01 [X(C8H10)]
dipole: -0.2031906 0.0000319 -0.0762734 debye
dipolederiv: 0.0371095 -0.0263551 0.0028918 -0.0435307 0.0197656 0.0975469 0.0873477 0.1310181 0.0884695 0.036708 0.0261193 0.0032124 0.0434283 0.019873 -0.0974684 0.08748 -0.1311089 0.0886872 -0.0310794 -0.0253412 0.0362034 0.0407127 -0.0725986 -0.0961693 0.0073877 -0.1290265 0.1440546 -0.0306295 0.0253099 0.0363684 -0.0405973 -0.0724136 0.0965688 0.0077053 0.1292488 0.1439558 -0.0070016 0.0426264 0.0492365 0.0222162 0.0118487 -0.0266955 -0.0066249 -0.0712161 0.1247065 -0.0070594 -0.0426144 0.0494812 -0.0223042 0.0115878 0.0261748 -0.0062283 0.0708928 0.1242377 0.0116446 -0.1025804 -0.1613288 0.0718007 0.0557367 0.0666048 -0.2066436 0.1298415 -0.2057221 0.0113467 0.1024466 -0.1615243 -0.0721447 0.0553513 -0.0669085 -0.2066961 -0.129915 -0.2054018 0.0168741 0.0257582 0.0255514 0.0096561 -0.0301113 -0.1302523 -0.0009423 -0.1309337 -0.0909628 0.016903 -0.0255116 0.0253087 -0.009508 -0.0300531 0.1302604 -0.0012208 0.1309864 -0.0911391 0.0307264 -0.050879 0.043286 -0.0202782 -0.0079507 0.12722 0.0038359 0.1408137 -0.0874546 0.0307405 0.0508335 0.0431033 0.02016 -0.0082226 -0.1273299 0.0036631 -0.1409684 -0.087225 0.0703771 0.0089717 -0.0098477 -0.0225472 -0.0067347 0.0912993 0.0697671 0.1323663 -0.1268967 -0.1124445 -0.1039241 -0.0811009 -0.0745969 0.0171939 -0.0387708 -0.1112168 -0.0725984 0.0097931 -0.1125536 0.1043115 -0.0807504 0.0751157 0.0167832 0.038763 -0.110807 0.0725904 0.0105038 0.0706122 -0.0092858 -0.0102849 0.0221271 -0.0062817 -0.0910058 0.0691518 -0.1320205 -0.1273483 -0.0161229 0.0929108 0.0949913 0.1078509 0.0129721 -0.0608555 0.1569368 -0.0718425 0.1439833 -0.0161511 -0.0927965 0.0952025 -0.1075605 0.0132541 0.0610178 0.1571043 0.0718718 0.143759 unknown
polarizability: 88.5347364|-0.0016021|78.0925454|-2.967161|-0.0074927|59.2766914 unknown
InChI: InChI=1S/C8H10/c1-2-6-5(1)7-3-4-8(6)7/h1-2,5-8H,3-4H2
charge 0 multiplicity 1
18 atoms
C  -0.577276 -0.797936 -0.518446
C  -0.57734 0.798182 -0.518432
C  0.606362 -0.805075 0.519232
C  0.60684 0.805723 0.518434
C  -1.994522 -0.785687 0.153358
C  -1.994062 0.785587 0.154755
C  1.994722 -0.68669 -0.115038
C  1.994904 0.68588 -0.116252
H  -0.450043 -1.416351 -1.420411
H  -0.451279 1.416521 -1.420605
H  0.478546 -1.416319 1.427603
H  0.479874 1.417947 1.426274
H  -2.03803 -1.266582 1.147358
H  -2.784664 -1.224439 -0.47942
H  -2.784823 1.226359 -0.475802
H  -2.035621 1.264363 1.149875
H  2.681904 -1.439679 -0.513503
H  2.682309 1.437996 -0.515979
