program: Gaussian 09
title: 000142374
version: EM64L-G09RevD.01
frameworkgroup: C1[X(C22H29NO)]
method: RPBEPBE
basis: SDD
operation: Freq
keyword: #p
keyword: freq=noraman
keyword: PBEPBE/SDD
title: #p freq=noraman PBEPBE/SDD
converged: YES YES NO NO
title: Mulliken charges:
elementType: O N C C C C C C C C C C C C C C C C C C C C C C H H H H H H H H H H H H H H H H H H H H H H H H H H H H H
charge: -0.259379 -0.079704 -0.360577 -0.376408 -0.388156 -0.351739 -0.575027 -0.356364 0.512748 -0.696177 -0.393333 -0.427095 -0.382749 -0.351570 0.233155 -0.390382 0.446807 -0.381190 -0.359329 0.342467 -0.364103 -0.361678 -0.245423 -0.683902 0.190307 0.191454 0.191129 0.191571 0.209806 0.209828 0.187818 0.187650 0.206396 0.205968 0.195106 0.195225 0.215220 0.209585 0.209709 0.231519 0.229875 0.248595 0.234803 0.212365 0.224780 0.277755 0.245453 0.251206 0.210472 0.210459 0.233463 0.233448 0.208143
chargesum: 0.00000
title: Mulliken charges with hydrogens summed into heavy atoms:
elementType: O N C C C C C C C C C C C C C C C C C C C C C C
charge: -0.259379 -0.079704 0.021184 0.006293 0.031477 0.023729 -0.162662 0.033967 0.512748 -0.061663 -0.161814 -0.197220 -0.134153 -0.116767 0.233155 -0.178016 0.446807 -0.156410 -0.081574 0.342467 -0.118650 -0.110472 0.175509 -0.008849
polarizability: 5.37478422e+02 -4.75760719e+01 1.93206978e+02 1.18770150e+01 2.78131821e+01 1.86637218e+02
1716.lowfreq: -15.7725 -4.3681 -2.5167 -0.0018 -0.0005 0.0013 8.1037 12.4329 19.6788
frequency: 6.7641 12.0132 18.1570 29.8769 35.9925 45.3462 53.0151 64.5058 84.1352 88.5903 112.1755 120.4521 123.2371 132.7002 138.8818 151.0466 181.6524 211.3053 218.2730 225.2094 245.7777 258.2701 290.1739 325.3390 354.2766 360.9451 393.7895 403.2608 410.9172 420.0894 428.0856 462.1321 483.6329 516.6099 532.9507 560.9363 616.7308 630.7682 637.6045 720.0614 727.7638 730.5680 739.9951 746.4220 759.3406 786.0853 804.6934 818.8365 826.2816 830.6381 831.5219 843.5477 852.3546 867.5193 888.2417 900.8045 904.4268 935.9278 948.4063 969.1824 978.4646 989.0533 991.1087 995.2636 999.0379 1004.7948 1026.9868 1034.1661 1038.3614 1070.6644 1073.2395 1081.0269 1111.0748 1116.8048 1117.9336 1123.6308 1134.5220 1162.8844 1173.0152 1187.1972 1194.0479 1216.2337 1219.0254 1223.9947 1228.5856 1256.0129 1260.9310 1265.0045 1265.9434 1279.3957 1287.2007 1291.4044 1296.5256 1303.7051 1307.0282 1332.1716 1347.4822 1348.2900 1351.7546 1363.8948 1371.2669 1387.1791 1393.7393 1401.6538 1414.6595 1430.4882 1461.2736 1461.7192 1462.2564 1466.3252 1471.6017 1475.9813 1476.0353 1478.8053 1485.6495 1485.6965 1488.7844 1491.6727 1505.2770 1561.6258 1566.5819 1591.5949 1621.3415 1623.6113 2935.9479 2948.7872 2949.9382 2956.8967 2957.6381 2966.0049 2967.8502 2970.8155 2976.2448 2983.4298 2992.5431 2998.0637 3007.7843 3017.1093 3018.2608 3032.7644 3046.7288 3067.2375 3069.8601 3095.3271 3107.4202 3112.1102 3118.1388 3118.6876 3138.1501 3151.4378 3158.7690 3163.1942 3171.8531
redmass: 3.1902 4.6580 1.7672 4.1079 3.7460 3.9739 3.1362 3.7275 3.9315 1.9052 2.1828 2.2298 3.4499 2.7519 2.2696 4.8701 4.8541 3.3601 3.8006 1.1239 1.2267 4.0807 3.7854 2.8540 3.4353 3.9111 4.1920 3.6420 2.9731 3.1407 4.1287 3.3275 4.2988 3.5882 3.0598 2.9010 5.0444 6.5451 6.7753 1.0632 3.5106 1.0916 3.6015 4.1466 1.1456 4.4401 1.3004 1.2531 1.8424 2.7308 1.1382 1.6390 1.5449 3.3661 1.8725 3.3861 1.2441 1.3632 1.3966 1.3773 1.5628 4.2435 1.2177 1.3757 2.6425 2.7298 3.1575 2.7601 3.4208 1.3115 2.5413 2.1884 1.4986 2.4968 1.8452 1.2447 1.4339 1.9117 1.2168 1.7286 1.6040 1.7245 1.6221 2.9364 1.4125 2.2532 1.1465 1.3465 1.2654 1.0547 1.1218 1.0996 1.3546 1.3268 1.3883 1.4414 2.2143 1.5693 1.6736 1.4964 3.3699 1.2165 2.1740 1.3659 3.3934 4.1921 1.0396 1.0745 1.0733 1.0761 1.0828 1.0430 1.1050 1.0822 1.1075 1.2514 1.0972 1.8991 2.5374 7.2573 6.9853 6.2348 6.4197 6.5411 1.0854 1.0589 1.0588 1.0591 1.0554 1.0590 1.0585 1.0367 1.0592 1.0969 1.0996 1.0363 1.1015 1.1076 1.1032 1.1046 1.1047 1.1007 1.0993 1.0989 1.1014 1.0871 1.0889 1.0893 1.0957 1.0878 1.0953 1.0939 1.0974
irintensity: 0.7796 0.2633 0.0175 0.4290 0.6516 0.3695 0.0895 0.0444 0.1353 0.0149 0.3337 0.9448 2.8388 0.7590 0.2917 0.9848 2.3950 4.8785 0.5023 0.0011 0.3688 2.3734 6.7011 1.0046 6.0801 2.3796 1.0372 1.6431 5.1472 1.3210 0.5793 1.6249 3.8224 3.7774 25.7376 38.4660 13.5497 6.3444 2.5296 12.5965 2.2835 0.0137 3.5962 3.2061 2.2326 3.5838 25.7301 4.6669 27.0350 0.9357 0.0626 10.1604 52.3314 31.2312 10.2964 60.6642 0.4301 2.2664 0.1729 1.8842 17.7297 0.3299 0.6170 2.9934 4.4349 6.1446 2.2325 100.8733 1.6577 1.5990 2.0047 0.3942 15.3533 24.9701 12.9785 11.1819 4.5891 86.4258 175.9497 0.0063 4.9778 1.1337 30.3401 304.4254 0.5583 88.4730 0.0571 0.9577 0.8155 0.4719 0.1449 0.1250 25.2571 12.4916 2.4319 1.1144 8.8212 0.2336 0.5649 10.3602 4.7615 11.3787 1.3766 36.6083 4.2154 48.8870 12.0946 0.0042 0.0221 0.6217 0.3520 11.5211 38.0678 2.0468 3.9408 17.2138 27.7209 34.6489 172.5602 115.8017 42.2265 93.5757 147.2874 34.5574 57.0765 3.5710 1.4750 25.1864 44.9407 27.7207 60.0988 41.4757 126.4633 0.5928 0.6834 32.5903 0.6998 34.4942 0.9089 34.0723 118.9142 97.3398 55.0335 29.7492 33.9062 19.1846 34.9835 13.5709 18.1739 2.0549 8.1479 22.3847 9.5810
temp: 298.150 k
press: 1.00000 atm
elementType: 8 7 6 6 6 6 6 6 6 6 6 6 6 6 6 6 6 6 6 6 6 6 6 6 1 1 1 1 1 1 1 1 1 1 1 1 1 1 1 1 1 1 1 1 1 1 1 1 1 1 1 1 1
symmnumber: 1
zpe: 1188130.5 jmol-1
zpe.correction: 0.452535 hartree
zpe.thermalcorrener: 0.478115 hartree
zpe.thermalcorrenthalpy: 0.479059 hartree
zpe.thermalcorrgfe: 0.390794 hartree
zpe.sumelectzpe: -983.911886 hartree
zpe.sumelectthermal: -983.886306 hartree
zpe.sumelectthermalent: -983.885362 hartree
zpe.sumelectthermalfe: -983.973627 hartree
dipole: -1.3713 2.6839 1.4469
dipole: 3.3433
quadrupole: -108.4213 -144.1579 -142.0632
quadrupole: -18.0101 -6.4784 6.7401
quadrupole: 23.1262 -12.6104 -10.5157 -18.0101 -6.4784 6.7401
hfenergy: -984.3644212 hartree
pointgroup: C01 [X(C22H29N1O1)]
dipole: 0.5315583 0.9823949 -0.6945902 debye
polarizability: 537.6340389|48.0931914|186.6497555|2.0258656|-28.417274|193.0388225 unknown
InChI: InChI=1S/C22H29NO/c1-3-5-6-7-8-9-19-10-14-21(15-11-19)23-18-20-12-16-22(17-13-20)24-4-2/h10-18H,3-9H2,1-2H3
charge 0 multiplicity 1
53 atoms
O  7.886609 0.461194 0.313515
N  1.507124 -0.743977 0.255547
C  -6.535647 -0.283751 -0.19141
C  -7.332923 0.969794 0.234658
C  -5.007514 -0.116369 -0.041395
C  -8.861833 0.799483 0.085468
C  -4.220683 -1.39053 -0.460646
C  -9.66303 2.047926 0.520613
C  -2.716736 -1.234361 -0.303766
C  -11.189108 1.86749 0.369725
C  -2.086874 -1.462296 0.949573
C  -1.898645 -0.840241 -1.394335
C  -0.698214 -1.299174 1.110198
C  -0.509223 -0.655799 -1.242586
C  0.111773 -0.869616 0.022852
C  2.233647 0.141154 -0.386369
C  3.688648 0.233639 -0.215343
C  4.423469 1.224548 -0.917364
C  4.397266 -0.655533 0.648147
C  6.506274 0.447887 0.088147
C  5.821895 1.341148 -0.776094
C  5.78482 -0.551175 0.79998
C  8.698577 1.473238 -0.395661
C  10.146261 1.257212 0.035484
H  -6.869675 -1.153285 0.413239
H  -6.776269 -0.530494 -1.247054
H  -7.09302 1.215313 1.290419
H  -6.999903 1.839833 -0.369113
H  -4.661316 0.740964 -0.653368
H  -4.760339 0.132999 1.010428
H  -9.103719 0.560123 -0.971423
H  -9.194006 -0.074276 0.684734
H  -4.471046 -1.628135 -1.513464
H  -4.580451 -2.240883 0.152647
H  -9.331112 2.920708 -0.078244
H  -9.419842 2.285841 1.576441
H  -11.738974 2.771525 0.690446
H  -11.461598 1.661525 -0.682761
H  -11.54944 1.018066 0.980519
H  -2.693819 -1.788044 1.803715
H  -2.357301 -0.690633 -2.380056
H  -0.209738 -1.49421 2.070404
H  0.10348 -0.389276 -2.112143
H  1.782304 0.886536 -1.077363
H  3.892506 1.915676 -1.584525
H  3.82368 -1.417123 1.185627
H  6.358755 2.115345 -1.331385
H  6.341912 -1.224325 1.458859
H  8.342191 2.487254 -0.121049
H  8.577675 1.338264 -1.49006
H  10.250371 1.382434 1.1266
H  10.484695 0.241583 -0.231116
H  10.804764 1.989401 -0.466191
