program: Gaussian 09
title: 000142373
version: EM64L-G09RevD.01
frameworkgroup: C1[X(C24H33NO)]
method: RPBEPBE
basis: SDD
operation: Freq
keyword: #p
keyword: freq=noraman
keyword: PBEPBE/SDD
title: #p freq=noraman PBEPBE/SDD
converged: YES YES NO NO
title: Mulliken charges:
elementType: O N C C C C C C C C C C C C C C C C C C C C C C C C H H H H H H H H H H H H H H H H H H H H H H H H H H H H H H H H H
charge: -0.257416 -0.080058 -0.353003 -0.384198 -0.355965 -0.575617 -0.355228 0.512449 -0.340529 -0.397230 -0.695802 -0.395191 -0.424220 -0.351102 -0.309061 -0.382424 -0.352379 0.233840 -0.692646 0.354138 0.447633 -0.359105 -0.372493 -0.391468 -0.383025 -0.360272 0.188724 0.188410 0.209016 0.208355 0.189374 0.189637 0.205712 0.205879 0.194726 0.195038 0.186338 0.186473 0.213428 0.213362 0.215189 0.210244 0.209879 0.231562 0.229708 0.198128 0.198202 0.207345 0.207522 0.248505 0.234956 0.209829 0.209951 0.219290 0.249002 0.251889 0.212421 0.224647 0.277631
chargesum: 0.00000
title: Mulliken charges with hydrogens summed into heavy atoms:
elementType: O N C C C C C C C C C C C C C C C C C C C C C C C C
charge: -0.257416 -0.080058 0.024131 0.033173 0.023046 -0.164025 0.034536 0.512449 0.032282 0.029560 -0.060489 -0.163629 -0.194512 0.045229 0.105805 -0.133920 -0.117423 0.233840 -0.053576 0.354138 0.447633 -0.110103 -0.120604 -0.179047 -0.158379 -0.082641
polarizability: 5.83706381e+02 -2.52081764e+01 2.13851935e+02 1.00822750e+01 2.88183900e+01 1.97362211e+02
1716.lowfreq: -7.8879 -0.0016 -0.0003 0.0016 0.2936 4.3031 5.9245 15.4036 18.2733
frequency: 5.2386 15.3179 18.0840 28.2681 38.5992 41.1961 47.0324 53.1963 59.9546 66.4246 79.4096 99.1899 115.1930 121.2250 129.7894 131.8514 146.7152 152.9695 157.6994 192.9521 214.9929 221.1787 227.8852 237.2951 251.4369 294.1290 319.0595 331.5804 347.9883 376.6634 410.0708 417.6917 420.8831 437.1900 447.0745 463.9489 489.6732 518.3209 534.8223 562.1554 619.7008 630.8762 637.6671 722.4076 728.0791 731.3079 739.1598 740.4038 762.2448 772.9118 787.9981 791.5443 812.9342 825.4011 831.7253 844.4900 853.0074 857.4008 868.1539 876.7626 889.0415 891.2660 938.3456 948.4370 969.3450 969.9986 970.2238 975.8381 980.2182 994.8900 999.3119 1003.9282 1010.1491 1013.7409 1019.6946 1064.0284 1070.3027 1072.1045 1077.0370 1078.3582 1112.1192 1114.0787 1124.3253 1127.0633 1146.3783 1163.9572 1173.9117 1191.5980 1194.0930 1202.7638 1217.5541 1223.9881 1228.6073 1241.1088 1253.4250 1257.3222 1262.5703 1276.8287 1282.5762 1283.9507 1287.1142 1292.7195 1294.1669 1296.4560 1304.3069 1319.7074 1323.2323 1346.6278 1349.0205 1353.8206 1355.4238 1370.0664 1380.7218 1388.6528 1390.8303 1396.8487 1414.7231 1430.9054 1462.8674 1463.3164 1468.0743 1468.8128 1468.9109 1475.9821 1476.5344 1476.7110 1477.9926 1483.3623 1484.6560 1489.1616 1489.5689 1492.1908 1505.0942 1561.5695 1566.6207 1591.9458 1621.1844 1623.6415 2936.3294 2948.2386 2950.6765 2955.8550 2956.1103 2966.2098 2968.5583 2971.4877 2972.2644 2973.2917 2977.2411 2986.7798 2995.0692 2996.1703 3001.3229 3006.5017 3015.4848 3026.0258 3030.6536 3047.2325 3061.5577 3069.1019 3070.2411 3070.6246 3073.5783 3111.1284 3118.2660 3119.2401 3136.9352 3151.3829 3159.0717 3166.6627 3171.9686
redmass: 3.8233 3.8828 4.2641 3.4274 3.1259 1.8540 3.3809 2.0240 3.3617 3.2251 3.5628 4.0805 2.1720 2.5423 2.0866 2.1817 3.5589 4.1050 2.8810 4.9206 3.2477 1.1864 3.9383 1.1208 3.7064 4.2765 3.1771 4.0158 3.0371 3.9462 2.9328 3.7822 3.0115 3.4256 3.6045 4.6092 4.2165 3.3884 3.0612 2.9652 5.2040 6.6069 6.7675 1.0651 3.5964 1.0721 1.1035 3.6462 4.8219 1.1151 1.2572 4.0041 1.3442 1.8212 2.9079 1.6899 1.5327 1.1794 3.4015 1.2575 1.9028 1.9639 1.3567 1.3833 1.4588 1.4988 2.4192 1.2623 1.4752 1.3760 2.6600 2.9668 3.7449 3.3090 3.6623 2.7652 1.3264 2.4177 2.5302 2.2636 1.3299 2.4061 1.2484 2.5670 1.4459 1.9063 1.2200 1.6665 1.6086 1.4522 2.1671 2.8798 1.3864 1.3550 1.2975 2.2732 1.2456 1.1652 1.3568 1.0549 1.0834 1.1189 1.1426 1.3164 1.3167 1.3591 1.4052 1.4921 2.3090 1.6504 1.5869 3.9980 1.5398 1.2170 1.2322 2.3565 3.3830 4.1558 1.0787 1.0676 1.0695 1.0844 1.0829 1.0902 1.0780 1.0450 1.0428 1.1661 1.0834 1.3387 1.1911 1.4740 2.5636 7.2799 7.0065 6.1961 6.4430 6.5185 1.0855 1.0553 1.0587 1.0586 1.0587 1.0589 1.0589 1.0577 1.0364 1.0380 1.0591 1.0972 1.0593 1.0990 1.1001 1.1060 1.1020 1.1035 1.1043 1.1047 1.1046 1.1006 1.1013 1.0994 1.0992 1.0872 1.0890 1.0894 1.0959 1.0878 1.0953 1.0934 1.0972
irintensity: 0.3086 0.1833 0.0490 0.1701 0.2473 0.0728 0.5569 0.1327 0.1145 0.1290 0.0573 0.4743 0.4353 0.3795 0.3004 0.0191 0.0507 0.2443 4.9875 1.6540 4.1233 0.2417 1.0760 0.0202 1.1320 2.1217 0.9731 12.0075 2.7598 2.3025 3.5151 1.4117 0.6333 0.6160 2.9971 2.0984 1.9664 3.7849 27.0325 39.6595 16.9941 6.6221 2.7864 11.1831 2.2856 11.3174 0.0069 3.1907 7.1166 1.0854 1.8945 3.4802 17.5830 32.6994 1.3570 13.3912 54.3823 0.0225 36.6012 1.0936 6.3772 22.0441 2.8671 0.2047 22.0280 19.1601 79.5994 1.6623 14.0413 3.2566 4.8598 3.9354 0.4057 2.0062 9.9509 1.7796 2.5353 34.4138 3.4186 1.3911 27.0643 33.0136 10.4541 9.7809 0.7685 95.6452 172.2104 0.6752 5.1188 0.4954 5.9860 347.5548 5.7206 0.3257 3.3995 104.0073 0.2728 0.4335 0.5313 0.0313 0.4314 0.9562 1.2821 26.7169 13.6555 0.7916 1.0320 0.6692 6.2626 1.2937 2.5793 0.3288 17.4148 10.9847 14.3228 6.4537 4.6427 55.0643 0.0178 0.1585 0.6990 2.0956 1.0157 26.3248 0.7671 13.8358 12.1944 14.5350 3.3368 13.0944 17.2228 58.4118 189.5287 130.9248 47.4056 99.8277 165.8390 36.0759 56.9396 30.1992 6.2505 21.9502 8.8392 32.8843 33.2867 58.2263 40.4788 34.6127 126.3596 0.8166 38.9400 3.5358 0.6721 22.4373 1.4826 13.4078 18.8358 98.0832 26.9613 90.9908 123.1765 62.0391 54.4946 20.2734 34.6170 14.0082 18.1995 2.0532 8.3558 21.0353 10.7904
temp: 298.150 k
press: 1.00000 atm
elementType: 8 7 6 6 6 6 6 6 6 6 6 6 6 6 6 6 6 6 6 6 6 6 6 6 6 6 1 1 1 1 1 1 1 1 1 1 1 1 1 1 1 1 1 1 1 1 1 1 1 1 1 1 1 1 1 1 1 1 1
symmnumber: 1
zpe: 1335497.8 jmol-1
zpe.correction: 0.508664 hartree
zpe.thermalcorrener: 0.537022 hartree
zpe.thermalcorrenthalpy: 0.537966 hartree
zpe.thermalcorrgfe: 0.442990 hartree
zpe.sumelectzpe: -1062.357864 hartree
zpe.sumelectthermal: -1062.329506 hartree
zpe.sumelectthermalent: -1062.328562 hartree
zpe.sumelectthermalfe: -1062.423538 hartree
dipole: -1.8854 2.6474 1.1680
dipole: 3.4536
quadrupole: -119.9150 -159.6739 -156.4749
quadrupole: -9.6268 -2.1981 6.0389
quadrupole: 25.4396 -14.3193 -11.1203 -9.6268 -2.1981 6.0389
hfenergy: -1062.866528 hartree
pointgroup: C01 [X(C24H33N1O1)]
dipole: -0.734631 -1.0650225 -0.4150691 debye
polarizability: 583.9337137|24.4554789|216.895873|-5.3475921|28.1585721|194.0909402 unknown
InChI: InChI=1S/C24H33NO/c1-3-5-7-8-10-21-11-15-23(16-12-21)25-20-22-13-17-24(18-14-22)26-19-9-6-4-2/h11-18,20H,3-10,19H2,1-2H3
charge 0 multiplicity 1
59 atoms
O  -5.981488 0.360562 0.265116
N  0.481261 0.937511 0.027582
C  8.433972 -0.382542 -0.150867
C  6.897552 -0.351735 0.004913
C  9.097115 -1.570457 0.582282
C  6.239199 0.848401 -0.733186
C  10.635004 -1.602816 0.427942
C  4.728178 0.881107 -0.568135
C  -9.359716 -1.342299 -0.246519
C  -8.31227 -0.277445 0.153089
C  11.290442 -2.791022 1.164657
C  4.130457 1.501306 0.561948
C  3.87029 0.274662 -1.522193
C  -10.807852 -0.898267 0.063049
C  -6.884859 -0.729068 -0.159862
C  2.733787 1.511625 0.736795
C  2.471268 0.26253 -1.35029
C  1.88086 0.871186 -0.204031
C  -11.857356 -1.958342 -0.333882
C  -4.606395 0.189079 0.080166
C  -1.780951 0.061136 -0.20163
C  -4.007005 -0.966516 -0.484156
C  -3.795807 1.279177 0.503955
C  -0.3241 -0.024832 -0.35848
C  -2.604067 -1.017942 -0.617805
C  -2.404651 1.214489 0.363287
H  8.693166 -0.426632 -1.229833
H  8.86067 0.568774 0.231507
H  6.631703 -0.30463 1.080473
H  6.462919 -1.296149 -0.38079
H  8.671538 -2.522099 0.200501
H  8.83915 -1.526738 1.661184
H  6.685245 1.785871 -0.345161
H  6.504206 0.789533 -1.807393
H  10.891879 -1.647569 -0.650376
H  11.059014 -0.650951 0.80846
H  -9.272592 -1.565625 -1.330619
H  -9.149998 -2.293219 0.286901
H  -8.389317 -0.058525 1.235366
H  -8.513445 0.670544 -0.381775
H  12.388741 -2.79178 1.037175
H  11.076078 -2.751569 2.249411
H  10.905098 -3.75536 0.782678
H  4.770441 1.994892 1.304179
H  4.306975 -0.181835 -2.419613
H  -11.018356 0.051519 -0.469066
H  -10.895786 -0.674576 1.145527
H  -6.629903 -1.657473 0.392845
H  -6.753706 -0.913964 -1.246589
H  2.271975 2.00622 1.597478
H  1.830781 -0.178678 -2.123407
H  -11.807811 -2.180422 -1.416693
H  -11.690028 -2.90668 0.210973
H  -12.883238 -1.615388 -0.106556
H  -4.613086 -1.814194 -0.81575
H  -4.288243 2.155894 0.93572
H  0.056585 -0.969483 -0.805151
H  -2.139449 -1.911918 -1.053197
H  -1.763475 2.04232 0.681847
