program: Gaussian 09
title: 000142372
version: EM64L-G09RevD.01
frameworkgroup: C1[X(C23H31NO)]
method: RPBEPBE
basis: SDD
operation: Freq
keyword: #p
keyword: freq=noraman
keyword: PBEPBE/SDD
title: #p freq=noraman PBEPBE/SDD
converged: YES YES NO NO
title: Mulliken charges:
elementType: O N C C C C C C C C C C C C C C C C C C C C C C C H H H H H H H H H H H H H H H H H H H H H H H H H H H H H H H
charge: -0.258632 -0.080201 -0.352585 -0.385026 -0.356288 -0.574929 -0.355218 0.513036 -0.695685 -0.426524 -0.393374 -0.351431 -0.382305 0.235042 -0.381677 -0.342727 -0.295582 -0.685859 0.350017 0.447139 -0.393832 -0.387941 -0.337747 -0.357340 -0.389666 0.187617 0.189422 0.208869 0.209019 0.189306 0.189893 0.204991 0.206475 0.194857 0.194931 0.210031 0.210070 0.215181 0.230005 0.231313 0.235379 0.247672 0.211541 0.211474 0.194412 0.194210 0.206362 0.205954 0.212733 0.218600 0.212735 0.213251 0.251724 0.248576 0.228680 0.274056
chargesum: 0.00000
title: Mulliken charges with hydrogens summed into heavy atoms:
elementType: O N C C C C C C C C C C C C C C C C C C C C C C C
charge: -0.258632 -0.080201 0.024454 0.032861 0.022912 -0.163463 0.034570 0.513036 -0.060403 -0.196519 -0.162062 -0.116052 -0.134633 0.235042 0.041339 0.045895 0.116733 -0.041791 0.350017 0.447139 -0.180582 -0.136217 -0.089171 -0.128660 -0.115611
polarizability: 5.58865863e+02 3.21143194e+01 2.15311008e+02 -1.54736832e+01 2.55881354e+01 1.81669631e+02
1716.lowfreq: -12.5166 -0.0019 -0.0006 0.0011 1.2954 2.9549 8.1076 13.1446 22.8200
frequency: 7.5616 13.0856 22.8145 31.3502 38.0011 41.1371 50.3594 63.8433 68.3492 73.7913 90.5335 106.7396 118.8564 129.8788 135.0467 147.9551 151.1820 176.8756 214.4371 221.0057 225.4710 234.0716 238.9206 252.3517 309.4001 331.0625 346.1593 372.5970 389.2909 410.6392 418.8828 427.1196 439.6090 472.7445 485.3473 525.0817 534.3733 556.3007 613.4209 628.7463 637.2714 722.0687 727.2100 738.5884 738.8212 743.9237 761.5820 788.6775 792.7415 809.4742 823.6420 827.4336 831.2727 838.6849 845.7923 869.5080 875.1265 888.6713 903.8181 939.2198 946.9308 951.6822 963.8394 969.3746 975.9909 978.9851 987.4046 999.6720 1004.0613 1010.2979 1014.0549 1041.5739 1062.8900 1071.1300 1077.6029 1084.5226 1112.5412 1114.1332 1123.8636 1124.4324 1146.0155 1161.2746 1172.6509 1191.2446 1194.8028 1213.9939 1217.0643 1225.0851 1228.1440 1240.9978 1254.8203 1274.7837 1276.6573 1280.9358 1282.1711 1285.0076 1287.3643 1292.6455 1300.3619 1306.9302 1323.6941 1345.5085 1346.4610 1347.7097 1354.0820 1369.6044 1378.2595 1388.6078 1391.8200 1394.2912 1414.7516 1429.3308 1462.7271 1463.4564 1468.9714 1470.0020 1473.4272 1476.0687 1476.6548 1477.8323 1481.4083 1484.3822 1488.8508 1489.9433 1492.6118 1505.9620 1562.6447 1567.8537 1588.4140 1620.8337 1625.3432 2937.8371 2949.4786 2949.7947 2955.3548 2966.3934 2967.1232 2968.3160 2971.5086 2976.7043 2976.7450 2986.6479 2995.3256 3001.0543 3007.4330 3011.7303 3014.9908 3029.9676 3047.2457 3060.1423 3068.1221 3070.4039 3075.4549 3077.0731 3111.6483 3118.7292 3122.4647 3137.2687 3148.6446 3159.1064 3166.4127 3169.8847
redmass: 3.7265 4.4353 3.3178 2.9684 2.6217 2.6056 4.2084 3.0634 1.7459 3.6460 3.6952 3.5693 1.8522 3.8477 2.2319 2.0766 4.3544 4.9976 3.7862 3.3972 1.1446 1.1309 4.7974 3.7004 3.4083 4.1111 3.2569 3.8965 3.1861 2.9249 3.0014 3.5075 4.0388 4.4649 4.1839 2.8957 3.6313 2.9976 4.9192 7.0237 6.7737 1.0656 3.5959 1.1019 3.6582 1.0764 4.8727 1.2787 3.8182 1.1599 1.7170 1.2669 2.9088 1.5847 1.7759 3.6048 1.2557 1.8955 1.8014 1.1508 1.3745 1.3760 6.8670 1.3671 1.2455 1.3704 1.5086 2.6277 2.9875 3.7574 3.2960 3.4288 2.7415 1.3315 2.2605 2.1779 1.4096 2.4063 1.2624 2.4085 1.4519 1.7535 1.2418 1.6624 1.6290 1.3704 2.1807 2.8924 1.3837 1.3580 2.0924 1.3078 1.1593 1.1762 1.3493 1.0658 1.0940 1.1179 1.3652 1.3662 1.4123 1.9095 1.5373 1.6818 1.6537 4.1114 1.5121 1.2171 1.5224 1.7302 3.4197 4.1914 1.0740 1.0750 1.0801 1.0869 1.0783 1.0775 1.0447 1.0425 1.1198 1.0845 1.1035 1.5358 1.4690 2.5513 7.0903 7.4242 5.9762 6.4102 6.6567 1.0855 1.0552 1.0590 1.0589 1.0588 1.0590 1.0591 1.0367 1.0439 1.0512 1.0976 1.0593 1.1003 1.1040 1.1030 1.1020 1.1044 1.1047 1.1044 1.1007 1.0993 1.1015 1.0995 1.0872 1.0889 1.0895 1.0959 1.0876 1.0953 1.0948 1.0960
irintensity: 0.0603 0.2612 0.3123 0.1332 0.4492 0.0923 0.0229 0.1428 0.3358 0.0857 0.0469 0.3354 0.3490 1.7079 0.0914 4.9706 0.5385 1.5201 3.0382 1.6611 0.0760 0.0476 1.0879 0.8600 3.5906 9.5287 1.1202 1.4326 0.1079 2.7983 1.5534 1.2198 1.8964 8.0391 1.9772 3.9782 27.0770 43.8948 23.2089 1.2470 0.1517 11.2077 2.0937 0.0057 2.7922 11.1275 4.6147 2.3774 5.8094 1.0971 19.8840 7.6328 0.7623 31.0118 56.7774 30.2328 1.4701 6.1765 25.3883 0.4434 1.3891 6.3573 104.9054 0.7194 0.8537 2.7900 15.5842 4.0951 3.7859 0.6999 1.8376 30.2370 1.7159 2.4384 1.3027 11.0954 11.3726 33.5292 11.4016 15.3168 1.6988 185.1877 82.9499 0.7467 3.6257 0.0361 3.6394 358.1564 4.1545 0.2599 79.4248 9.0824 0.3836 0.4203 0.5071 0.0942 0.3429 0.2182 7.1504 14.9249 1.3161 21.8408 3.7492 14.8263 1.4232 1.1344 19.7999 11.0029 32.7090 21.1785 2.8600 0.8607 0.0613 0.1204 1.5119 10.2084 4.7529 1.4363 11.4689 13.1649 42.7607 2.6935 23.5973 5.3618 56.6922 190.9641 36.4343 20.0838 209.1788 172.8438 11.1313 61.9740 30.2577 6.1606 10.0424 32.1515 34.3998 27.3906 39.7282 117.0643 55.0026 0.8470 37.8025 1.0273 27.9043 0.5358 1.6335 17.3634 95.6380 18.0924 96.0817 60.1005 101.9081 50.0762 19.8436 33.8312 12.8855 18.5083 6.3376 8.2723 11.4195 16.8588
temp: 298.150 k
press: 1.00000 atm
elementType: 8 7 6 6 6 6 6 6 6 6 6 6 6 6 6 6 6 6 6 6 6 6 6 6 6 1 1 1 1 1 1 1 1 1 1 1 1 1 1 1 1 1 1 1 1 1 1 1 1 1 1 1 1 1 1 1
symmnumber: 1
zpe: 1262218.0 jmol-1
zpe.correction: 0.480753 hartree
zpe.thermalcorrener: 0.507697 hartree
zpe.thermalcorrenthalpy: 0.508641 hartree
zpe.thermalcorrgfe: 0.417612 hartree
zpe.sumelectzpe: -1023.134766 hartree
zpe.sumelectthermal: -1023.107823 hartree
zpe.sumelectthermalent: -1023.106879 hartree
zpe.sumelectthermalfe: -1023.197908 hartree
dipole: 1.5314 -0.0075 -0.1562
dipole: 1.5394
quadrupole: -114.7847 -149.6496 -151.4092
quadrupole: -6.9430 -5.9038 7.1768
quadrupole: 23.8298 -11.0351 -12.7947 -6.9430 -5.9038 7.1768
hfenergy: -1023.6155197 hartree
pointgroup: C01 [X(C23H31N1O1)]
dipole: -0.6023001 -0.016532 -0.0614295 debye
polarizability: 559.6643248|31.3465699|188.294236|2.4890682|-28.9041043|207.8879421 unknown
InChI: InChI=1S/C23H31NO/c1-3-5-7-8-9-20-10-14-22(15-11-20)24-19-21-12-16-23(17-13-21)25-18-6-4-2/h10-17,19H,3-9,18H2,1-2H3
charge 0 multiplicity 1
56 atoms
O  -6.481402 -0.848502 0.354755
N  -0.115209 0.528992 -0.146781
C  7.938727 0.122929 -0.051023
C  6.405465 -0.05834 -0.097879
C  8.71614 -1.163465 -0.410774
C  5.634385 1.244267 0.258525
C  10.250796 -0.978848 -0.377473
C  4.12551 1.074158 0.183154
C  11.020472 -2.267426 -0.740031
C  3.359356 0.761721 1.336023
C  3.439513 1.20398 -1.054547
C  1.965881 0.561334 1.260582
C  2.046305 1.024244 -1.140455
C  1.288152 0.675759 0.011467
C  -8.762857 -0.430992 -0.335104
C  -9.732242 0.38277 -1.224383
C  -7.307049 -0.008396 -0.538451
C  -11.203697 -0.040071 -1.026835
C  -5.096606 -0.653813 0.350132
C  -2.267359 -0.41683 0.497651
C  -0.806026 -0.309902 0.590012
C  -4.360288 -1.488302 1.230546
C  -4.420341 0.300737 -0.45964
C  -2.963606 -1.367239 1.29932
C  -3.020929 0.410816 -0.379307
H  8.232483 0.935659 -0.748554
H  8.238557 0.461862 0.963046
H  6.100378 -0.862753 0.60159
H  6.100298 -0.39449 -1.109527
H  8.411528 -1.506305 -1.421741
H  8.43004 -1.974943 0.290683
H  5.961738 2.044652 -0.435048
H  5.932139 1.563064 1.27696
H  10.534571 -0.167469 -1.078674
H  10.554376 -0.636001 0.632874
H  10.77799 -3.085266 -0.035303
H  10.755527 -2.613291 -1.757127
H  12.114378 -2.109366 -0.710904
H  3.862531 0.688966 2.308606
H  4.006585 1.46563 -1.956779
H  1.393631 0.359694 2.17403
H  1.514796 1.14356 -2.090177
H  -9.029876 -0.300907 0.731185
H  -8.859313 -1.510109 -0.561618
H  -9.62474 1.463239 -0.997824
H  -9.45201 0.256492 -2.290179
H  -7.161493 1.06074 -0.277925
H  -6.989458 -0.164983 -1.590457
H  -11.519962 0.104624 0.023091
H  -11.881874 0.550382 -1.669235
H  -11.345406 -1.108323 -1.275896
H  -0.318404 -1.003606 1.309505
H  -4.904632 -2.214417 1.841585
H  -4.973669 0.950771 -1.143647
H  -2.398302 -2.015261 1.980904
H  -2.477899 1.137773 -0.992027
