program: Gaussian 09
title: 000142347
version: EM64L-G09RevD.01
frameworkgroup: C1[X(C16H34N2)]
method: RPBEPBE
basis: SDD
operation: Freq
keyword: #pfreq=noraman
keyword: PBEPBE/SDD
title: #p freq=noraman PBEPBE/SDD
converged: YES YES NO NO
title: Mulliken charges:
elementType: N N C C C C C C C C C C C C C C C C H H H H H H H H H H H H H H H H H H H H H H H H H H H H H H H H H H
charge: -0.081938 -0.082842 0.310345 0.310241 0.214256 0.215940 -0.421231 -0.421779 -0.728378 -0.731985 -0.732837 -0.732372 -0.728451 -0.731937 -0.719800 -0.738429 -0.720165 -0.738796 0.202266 0.182392 0.202021 0.182306 0.209920 0.209780 0.213983 0.235521 0.204576 0.206219 0.199619 0.227250 0.217624 0.199435 0.227281 0.217297 0.214012 0.209774 0.209874 0.206199 0.204582 0.235338 0.226158 0.214082 0.225820 0.231988 0.206758 0.216445 0.226540 0.214062 0.225438 0.232627 0.206747 0.216221
chargesum: 0.00000
title: Mulliken charges with hydrogens summed into heavy atoms:
elementType: N N C C C C C C C C C C C C C C C C
charge: -0.081938 -0.082842 0.310345 0.310241 0.214256 0.215940 -0.036573 -0.037452 -0.094695 -0.085668 -0.088344 -0.088359 -0.094791 -0.085817 -0.053740 -0.083238 -0.054126 -0.083201
polarizability: 2.25840668e+02 4.97374272e-02 1.81390114e+02 2.83431226e+00 -2.58805460e-03 1.69265320e+02
1716.lowfreq: -17.3658 -14.8854 -9.1893 -0.0005 -0.0005 0.0003 9.7165 30.0403 39.3915
frequency: 6.0764 29.5690 39.0833 42.9578 63.6285 102.8382 120.7774 136.1504 170.4941 177.0361 200.4007 205.8733 206.4567 215.0710 217.1577 235.7669 237.2983 246.0430 250.8645 251.8509 258.3058 265.6141 272.5178 277.5676 293.3579 299.9158 300.2506 345.5744 346.1064 365.5005 379.7384 393.0367 400.2213 401.3169 416.8734 419.0208 470.0556 499.1914 526.9957 571.4853 597.0993 727.2958 738.3426 756.6730 791.4718 823.3436 847.0187 868.3505 871.4133 900.7295 917.3693 919.7333 920.7996 927.4629 929.2686 930.9919 937.9710 939.2464 943.7607 970.3218 974.1055 997.5118 1000.8804 1021.7600 1024.5563 1031.1011 1034.7128 1117.1981 1119.6146 1126.2552 1146.6478 1208.2684 1212.0904 1217.2934 1218.3102 1240.8427 1255.1052 1256.1127 1258.3585 1320.7021 1323.9694 1347.0315 1349.5238 1362.1185 1362.9852 1371.9635 1372.0853 1376.3801 1378.4036 1384.0655 1384.4369 1401.7394 1402.5745 1438.0945 1439.4339 1450.0670 1450.3459 1457.3453 1457.9228 1460.7925 1461.7444 1463.3588 1463.4848 1464.9263 1465.8909 1469.5010 1470.0008 1472.2984 1476.8995 1478.3943 1486.3591 1489.7384 1491.0364 1493.2048 1497.1241 1498.7447 2959.9595 2960.0557 2963.3502 2963.5259 2968.9712 2969.2323 2975.2264 2975.5535 2979.6810 2980.6391 2992.3388 2992.8053 3018.4151 3018.4367 3054.0217 3054.0431 3059.4347 3059.8736 3062.8841 3063.1462 3068.0991 3068.8815 3079.9490 3082.9342 3083.8987 3084.3282 3085.4408 3086.2507 3087.8489 3088.0224 3091.1227 3091.6056 3098.5967 3098.9661
redmass: 3.0411 2.7102 2.8021 3.7844 3.2147 3.1493 2.5183 2.3318 2.2804 2.0457 1.2732 1.3935 1.9161 1.0728 1.0796 1.3010 1.1901 1.1514 1.1469 1.1429 1.1785 1.7116 2.0870 2.4885 2.3024 2.4725 2.3929 1.9509 2.1395 2.2707 2.3114 2.6050 1.8495 2.1214 2.1726 2.4566 2.6425 2.6545 3.0875 3.3005 2.9575 3.9700 3.5350 3.7865 3.2123 2.8889 2.5948 1.8947 2.3835 2.2204 2.1673 1.6314 1.5887 1.5704 1.6240 1.4855 1.7296 1.2235 1.2308 1.6324 1.6210 1.3714 1.3609 1.4202 1.4175 1.3991 1.4085 1.9785 1.5877 1.9606 2.4846 2.6024 2.5312 2.4615 2.4622 3.7178 3.6341 3.2068 3.3731 1.4852 1.5145 1.3151 1.3352 1.1970 1.2020 1.2013 1.2025 1.2024 1.2038 1.2251 1.2186 1.2069 1.2076 1.1149 1.0812 1.0592 1.1147 1.1067 1.0522 1.3954 1.0486 1.1622 1.0508 1.0798 1.0533 1.0586 1.5186 1.0778 1.0535 1.1123 1.0624 1.0651 1.0597 1.0568 1.0577 1.0592 1.0555 1.0549 1.0371 1.0372 1.0364 1.0364 1.0378 1.0377 1.0339 1.0341 1.0358 1.0358 1.1005 1.1006 1.0994 1.0994 1.0993 1.0991 1.0994 1.0995 1.0986 1.0983 1.0993 1.0989 1.0998 1.0999 1.1008 1.1006 1.0981 1.0980 1.0992 1.0990 1.0981 1.0981
irintensity: 0.0014 0.1596 0.0068 0.7704 0.0241 0.5055 0.6403 1.5030 0.0218 0.6239 0.0320 0.0433 0.0475 0.1220 0.0033 0.0423 0.5593 0.3373 0.1401 0.7849 0.1189 0.2079 0.8016 0.7105 1.9639 1.0339 0.1728 0.0615 1.1048 0.3325 0.1477 1.6078 0.0049 0.0662 1.8238 0.0924 0.9606 1.6607 1.3388 10.4486 3.2391 0.6774 0.1375 0.2209 0.3487 12.1891 0.5390 3.1030 0.4228 7.0842 0.0426 2.7328 3.1192 6.0766 0.0200 1.4111 1.4739 0.0723 0.0015 4.8620 6.5631 3.2969 3.3177 0.2263 0.7203 2.4805 0.0063 13.5906 0.8918 2.1917 10.8866 6.0282 0.1417 76.3971 1.6046 32.3783 6.1355 5.2300 22.0159 1.1406 1.2863 10.5782 14.5981 13.2557 16.8860 8.1103 30.3663 53.0096 0.4620 8.9882 20.4192 2.1971 18.2287 0.3803 3.1413 3.5165 9.4464 0.3177 6.0615 0.5429 2.0814 0.2964 6.7253 5.6231 12.2791 20.6347 0.4339 3.7839 14.2445 0.0004 7.4672 1.6293 63.7019 0.2526 2.3858 46.0006 11.1427 30.2025 91.7836 12.9725 96.6105 3.7280 5.6585 32.1269 9.6408 47.4755 35.3101 5.0680 29.7761 7.0159 3.3672 7.9747 84.7835 12.3597 26.1042 11.2484 22.1157 178.3880 44.1397 0.2183 27.8540 21.3540 3.1429 1.4246 80.4188 54.5071 126.7161 6.6267 12.7067 24.4627
temp: 298.150 k
press: 1.00000 atm
elementType: 7 7 6 6 6 6 6 6 6 6 6 6 6 6 6 6 6 6 1 1 1 1 1 1 1 1 1 1 1 1 1 1 1 1 1 1 1 1 1 1 1 1 1 1 1 1 1 1 1 1 1 1
symmnumber: 1
zpe: 1229639.4 jmol-1
zpe.correction: 0.468345 hartree
zpe.thermalcorrener: 0.492922 hartree
zpe.thermalcorrenthalpy: 0.493866 hartree
zpe.thermalcorrgfe: 0.414637 hartree
zpe.sumelectzpe: -738.046885 hartree
zpe.sumelectthermal: -738.022309 hartree
zpe.sumelectthermalent: -738.021364 hartree
zpe.sumelectthermalfe: -738.100593 hartree
dipole: 0.0109 0.5326 -0.0009
dipole: 0.5328
quadrupole: -113.3861 -115.7184 -118.5815
quadrupole: -0.0052 2.5689 0.0234
quadrupole: 2.5092 0.1769 -2.6861 -0.0052 2.5689 0.0234
hfenergy: -738.5152304 hartree
pointgroup: C01 [X(C16H34N2)]
dipole: 0.0040333 0.0000865 0.2095613 debye
polarizability: 224.8447796|-7.9606015|170.2609779|0.1138181|-0.0071248|181.3903441 unknown
InChI: InChI=1S/C16H34N2/c1-13(2,3)11-15(7,8)17-18-16(9,10)12-14(4,5)6/h11-12H2,1-10H3
charge 0 multiplicity 1
52 atoms
N  0.591492 0.251257 1.029052
N  -0.588472 -0.25053 1.018156
C  3.207496 0.034008 -1.029529
C  -3.209553 -0.036723 -1.032259
C  1.713919 -0.78627 1.122438
C  -1.711311 0.787808 1.114699
C  2.989776 -0.12573 0.513596
C  -2.988491 0.126719 0.510068
C  4.36194 1.06492 -1.20302
C  3.658326 -1.295891 -1.697013
C  1.95064 0.582794 -1.751758
C  -1.954028 -0.586207 -1.756252
C  -4.363644 -1.068866 -1.20084
C  -3.663182 1.291339 -1.701607
C  1.952853 -0.915656 2.659098
C  1.329405 -2.16721 0.548295
C  -1.945954 0.921534 2.651465
C  -1.326562 2.166944 0.536008
H  3.028637 0.889569 0.958783
H  3.866647 -0.676373 0.913827
H  -3.027042 -0.887512 0.95773
H  -3.864498 0.678566 0.910565
H  4.627239 1.180143 -2.27098
H  5.270979 0.742058 -0.659836
H  4.067588 2.05825 -0.814861
H  2.877682 -2.07351 -1.654172
H  4.566574 -1.696222 -1.20644
H  3.900163 -1.123794 -2.763531
H  2.190077 0.816087 -2.807176
H  1.583924 1.504122 -1.26415
H  1.125986 -0.151171 -1.749495
H  -2.195557 -0.821107 -2.810855
H  -1.58592 -1.506489 -1.267812
H  -1.129569 0.147988 -1.756735
H  -4.067556 -2.061165 -0.811374
H  -5.271563 -0.745564 -0.656032
H  -4.631512 -1.186471 -2.2679
H  -3.907261 1.116718 -2.767205
H  -4.570719 1.691787 -1.209805
H  -2.883341 2.06995 -1.662201
H  1.047438 -1.308304 3.155086
H  2.791627 -1.608788 2.850088
H  2.201537 0.064545 3.104557
H  0.501326 -2.607268 1.128504
H  2.199582 -2.846393 0.592001
H  0.992088 -2.09493 -0.499674
H  -1.038697 1.315089 3.143289
H  -2.784017 1.615292 2.843261
H  -2.193734 -0.05735 3.100484
H  -0.494118 2.605237 1.111235
H  -2.194582 2.848651 0.583293
H  -0.995762 2.092018 -0.513862
