program: Gaussian 09
title: 000142346
version: EM64L-G09RevD.01
frameworkgroup: C1[X(C13H3F23O5)]
method: RPBEPBE
basis: SDD
operation: Freq
keyword: #p
keyword: freq=noraman
keyword: PBEPBE/SDD
title: #p freq=noraman PBEPBE/SDD
converged: YES YES NO NO
title: Mulliken charges:
elementType: F F F F F F F F F F F F F F F F F F F F F F F O O O O O C C C C C C C C C C C C C H H H
charge: -0.105832 -0.100174 -0.111974 -0.114303 -0.133868 -0.109624 -0.112071 -0.123749 -0.118775 -0.111283 -0.119323 -0.121042 -0.121022 -0.115949 -0.122156 -0.124044 -0.120362 -0.122686 -0.123836 -0.128545 -0.123623 -0.128466 -0.116802 -0.266073 -0.271866 -0.251549 -0.216859 -0.169153 0.182512 0.188045 0.368508 0.359991 0.393454 0.389032 0.361833 0.200776 0.198069 0.394759 0.368919 0.219700 -0.488802 0.253876 0.256409 0.257928
chargesum: 0.00000
title: Mulliken charges with hydrogens summed into heavy atoms:
elementType: F F F F F F F F F F F F F F F F F F F F F F F O O O O O C C C C C C C C C C C C C
charge: -0.105832 -0.100174 -0.111974 -0.114303 -0.133868 -0.109624 -0.112071 -0.123749 -0.118775 -0.111283 -0.119323 -0.121042 -0.121022 -0.115949 -0.122156 -0.124044 -0.120362 -0.122686 -0.123836 -0.128545 -0.123623 -0.128466 -0.116802 -0.266073 -0.271866 -0.251549 -0.216859 -0.169153 0.182512 0.188045 0.368508 0.359991 0.393454 0.389032 0.361833 0.200776 0.198069 0.394759 0.368919 0.219700 0.279411
polarizability: 1.99388363e+02 -4.87615802e+00 1.67655366e+02 -6.87503623e+00 2.43497070e+00 1.52176004e+02
1716.lowfreq: -7.2934 -3.3667 -1.4995 -0.0006 -0.0005 0.0006 4.8463 6.1670 12.3142
frequency: 1.6524 6.1622 12.2719 14.5604 20.4356 22.8055 24.6814 33.1018 37.2282 42.0898 45.6119 47.9695 55.7548 62.1749 64.6346 76.6859 83.2108 85.5154 101.1757 115.7306 134.9727 143.5329 149.8028 169.9749 176.3950 185.4764 188.8820 190.1641 197.6763 202.4142 207.2743 212.8783 220.8377 231.4480 238.2511 243.3849 248.6357 264.1402 272.2913 272.9487 279.7944 280.5305 292.2519 296.3349 301.5862 304.0688 312.9660 315.4321 324.0522 330.5891 333.1620 391.4182 406.2791 407.1275 438.0671 451.1514 459.5810 460.4232 465.6681 470.1586 477.0823 486.0321 495.0573 497.7046 505.4319 520.7043 529.9706 542.0270 551.4259 562.7882 571.9440 600.9458 628.9964 647.1376 649.4036 656.3892 679.0426 684.7004 705.3555 710.2303 736.6855 755.7983 866.6696 884.9921 891.7167 896.8642 956.9456 974.8087 979.8373 986.4044 992.3539 997.3756 1002.4977 1011.8431 1028.3440 1034.4858 1040.6857 1046.6953 1050.9953 1054.5384 1054.9171 1070.5556 1074.9866 1078.0526 1081.2220 1084.8387 1088.4382 1104.9785 1110.3581 1114.9425 1153.6521 1170.9768 1178.4278 1188.2354 1191.4299 1196.6908 1208.2598 1216.0779 1224.7364 1422.8570 1454.7261 1456.9878 1660.6372 3017.8027 3127.1476 3173.7599
redmass: 7.0735 12.4051 17.3827 13.2539 15.6090 12.7782 16.0693 16.5776 17.7591 11.8064 18.1479 14.8061 13.6820 17.0371 14.1428 12.1086 2.1789 2.2715 4.3014 16.0912 16.5011 15.2189 14.9539 7.1162 12.1208 17.4818 16.4773 8.1175 15.8728 17.8129 18.4790 18.3250 18.3922 16.6319 17.8713 17.5004 11.3248 14.0996 18.0533 18.2560 18.0885 17.1734 13.9104 16.8978 14.1248 8.6724 18.4413 18.0599 11.6913 16.8935 18.3610 17.4832 17.6121 17.1770 15.7756 17.0738 17.6054 17.6642 16.5353 17.1151 17.0787 17.1111 17.3999 17.4597 16.9545 17.2447 16.0750 15.3663 16.8329 17.5071 16.6979 15.6324 16.0726 16.7224 14.8157 16.3450 15.6516 14.2533 16.8526 16.4512 12.6484 7.7144 10.6617 13.5135 13.1415 13.5847 11.6813 12.9646 12.9645 13.0870 12.8670 13.0744 13.0790 12.2804 12.7529 12.7138 13.2135 12.9702 13.0233 12.2284 13.1153 12.9679 12.4744 12.0504 12.9082 13.0664 13.0790 11.7187 10.7247 1.3009 1.4505 11.6008 12.3903 12.5680 11.9428 12.2875 10.9281 11.7629 12.2178 1.1764 1.0493 1.0495 10.7068 1.0292 1.1058 1.1058
irintensity: 1.6027 0.1848 0.0460 0.5914 0.0995 0.3747 0.0864 0.0594 0.0212 0.9609 0.0278 0.2623 0.2722 0.1057 0.0656 0.0445 0.1084 0.6968 0.1130 1.4464 0.4597 1.1308 1.9888 0.9094 0.4049 1.1075 0.8220 3.4703 0.4636 1.3418 0.8215 0.8526 1.8748 0.3726 2.0669 1.2258 12.7767 1.2736 0.8234 0.7110 0.9579 6.6087 3.5810 0.4261 4.3121 8.0155 0.1069 0.4495 2.4486 1.0317 0.3802 8.7007 6.5328 3.3294 3.5551 72.4890 5.1963 3.8531 1.5201 3.8529 12.3337 5.6330 0.3717 0.9850 1.0686 0.2784 11.1064 57.0592 26.9550 10.3426 1.1903 15.2453 38.1155 9.9550 47.9711 19.7890 5.9344 2.4388 34.6446 14.2252 7.6459 22.7702 18.2554 31.4323 169.9911 161.7349 120.4558 38.5383 38.5532 113.6849 171.9743 50.2143 18.0371 7.8595 57.8694 397.8217 127.2836 83.8761 24.5986 189.4545 181.7929 221.0321 14.0287 244.7338 47.9422 435.3029 582.1951 284.6078 1357.1111 26.9849 10.5882 278.3544 97.9040 13.0212 62.6491 40.4160 81.1551 66.7770 42.5459 13.0297 17.1441 13.6119 189.3078 14.4008 13.8176 6.8538
temp: 298.150 k
press: 1.00000 atm
elementType: 9 9 9 9 9 9 9 9 9 9 9 9 9 9 9 9 9 9 9 9 9 9 9 8 8 8 8 8 6 6 6 6 6 6 6 6 6 6 6 6 6 1 1 1
symmnumber: 1
zpe: 479846.5 jmol-1
zpe.correction: 0.182764 hartree
zpe.thermalcorrener: 0.225296 hartree
zpe.thermalcorrenthalpy: 0.226240 hartree
zpe.thermalcorrgfe: 0.095967 hartree
zpe.sumelectzpe: -3166.395034 hartree
zpe.sumelectthermal: -3166.352502 hartree
zpe.sumelectthermalent: -3166.351558 hartree
zpe.sumelectthermalfe: -3166.481831 hartree
dipole: -2.5306 3.8608 0.7392
dipole: 4.6750
quadrupole: -228.0997 -211.1367 -235.8576
quadrupole: -21.2935 -1.3529 3.9232
quadrupole: -3.0684 13.8946 -10.8263 -21.2935 -1.3529 3.9232
hfenergy: -3166.5777983 hartree
pointgroup: C01 [X(C13H3F23O5)]
dipole: 1.0355776 1.4569952 0.4333472 debye
polarizability: 199.5914543|6.83001|165.9894899|-4.3937547|4.973754|153.6387892 unknown
InChI: InChI=1S/C13H3F23O5/c1-38-2(37)3(14,7(19,20)21)39-12(33,34)5(17,9(25,26)27)41-13(35,36)6(18,10(28,29)30)40-11(31,32)4(15,16)8(22,23)24/h1H3
charge 0 multiplicity 1
44 atoms
F  -2.565285 -1.774224 -1.33321
F  1.26104 -0.742888 1.454684
F  -0.962921 0.833318 0.663629
F  -1.4895 -1.31711 1.133778
F  1.987211 1.222628 -0.312906
F  2.232417 -0.233942 -2.026304
F  -1.084172 -0.382994 -3.129934
F  -1.365998 1.58819 -2.035344
F  -3.134801 0.566275 -3.025821
F  2.731775 -2.953571 0.79489
F  0.540993 -3.359634 0.401257
F  1.948867 -2.976999 -1.337859
F  -5.207991 -0.790529 -1.433336
F  -4.615572 -1.51718 0.627436
F  -5.847722 1.712314 -0.536651
F  -6.830411 0.077138 0.722628
F  4.804416 1.075916 -1.536052
F  -4.066688 2.32086 1.46041
F  -6.146968 2.118162 2.329679
F  -4.619641 0.47077 2.657723
F  5.957383 -1.008147 1.232124
F  7.13262 0.462693 -0.03622
F  6.135633 -1.328746 -1.008621
O  0.045839 -0.869806 -0.588092
O  -3.391228 0.227284 -0.344913
O  3.629697 -0.457219 -0.177817
O  5.151155 2.762812 0.450788
O  3.977212 1.403151 1.950192
C  -2.275246 -0.430854 -0.981145
C  1.313155 -1.079544 0.079725
C  -1.113654 -0.446686 0.084051
C  2.345477 -0.120046 -0.621339
C  -1.949319 0.346126 -2.315759
C  1.651339 -2.616974 -0.018783
C  -4.658369 -0.372113 -0.201077
C  -5.606528 0.712111 0.427844
C  4.711736 0.504692 -0.233752
C  -5.092726 1.415385 1.737597
C  5.998335 -0.363521 -0.009947
C  4.546135 1.609402 0.864886
C  5.109643 3.900192 1.416155
H  5.670998 4.700266 0.91781
H  5.584379 3.5993 2.364026
H  4.061986 4.191043 1.595172
