program: Gaussian 09
title: 000142337
version: EM64L-G09RevD.01
frameworkgroup: C1[X(C18H18)]
method: RPBEPBE
basis: SDD
operation: Freq
keyword: #p
keyword: freq=noraman
keyword: PBEPBE/SDD
title: #p freq=noraman PBEPBE/SDD
converged: YES YES NO NO
title: Mulliken charges:
elementType: C C C C C C C C C C C C C C C C C C H H H H H H H H H H H H H H H H H H
charge: -0.125614 -0.125612 -0.587773 -0.587777 -0.587773 -0.587777 0.298158 0.298157 0.298157 0.298156 -0.438607 -0.438607 -0.438606 -0.438606 -0.234013 -0.234013 -0.234012 -0.234013 0.235494 0.235493 0.218785 0.225274 0.225275 0.218784 0.218785 0.225274 0.225275 0.218785 0.239936 0.239936 0.239936 0.239937 0.223302 0.223302 0.223301 0.223301
chargesum: 0.00000
title: Mulliken charges with hydrogens summed into heavy atoms:
elementType: C C C C C C C C C C C C C C C C C C
charge: 0.109880 0.109881 -0.143714 -0.143718 -0.143714 -0.143718 0.298158 0.298157 0.298157 0.298156 -0.198671 -0.198670 -0.198671 -0.198670 -0.010712 -0.010711 -0.010711 -0.010711
polarizability: 2.67827207e+02 2.08574595e-05 1.85702337e+02 -4.43244345e+00 1.37668828e-05 9.52876779e+01
1716.lowfreq: -0.0006 -0.0005 -0.0003 4.3496 6.0563 17.0452 35.1103 51.2695 70.5320
frequency: 35.1103 51.2695 70.5320 87.6464 182.1288 202.8049 208.0500 230.4812 245.1535 259.7678 334.4072 384.2751 416.1322 417.4173 478.0538 500.1400 506.7416 516.7657 540.8342 578.4822 585.3897 588.8665 669.4094 709.7614 711.5749 749.7228 752.1187 765.0210 785.2196 843.1471 843.5948 848.4713 867.9327 868.1406 885.6846 906.7471 906.8369 934.5031 938.4519 984.8560 984.8590 988.0766 1020.4819 1021.6821 1035.4226 1039.7251 1064.4869 1094.6166 1116.7765 1125.3574 1131.4922 1133.6514 1147.2341 1168.7354 1168.7450 1175.9461 1176.2211 1207.6444 1216.7568 1222.7006 1232.7281 1233.1819 1259.7009 1268.2674 1295.7459 1296.2600 1301.4656 1306.1281 1310.5056 1356.2807 1388.6515 1389.2207 1445.9914 1446.1648 1456.0531 1459.0365 1461.3558 1463.3749 1476.5767 1478.7166 1594.9539 1596.1723 1618.3378 1618.7097 2946.1053 2949.1806 2950.1566 2950.8262 2955.6565 2972.6763 3035.4220 3037.1981 3041.0618 3041.9557 3116.1471 3116.1764 3122.7493 3122.7724 3137.0539 3137.0935 3157.1662 3157.3391
redmass: 4.4784 4.0410 3.9048 3.9012 2.4856 2.3295 5.7702 3.9292 4.6149 2.7843 1.7717 3.5563 2.5835 2.7602 2.8015 2.9687 3.2689 5.4762 2.1000 6.0670 6.0877 5.2273 4.2266 3.1861 3.2182 1.2925 1.2971 2.9464 3.0990 4.6347 4.4182 3.3314 1.3047 1.3461 2.3134 1.5027 1.5386 1.4422 1.3784 1.3146 1.3146 1.8619 2.2052 2.2310 4.3846 1.8846 3.3614 2.0446 2.1202 1.9719 1.2002 1.1974 1.1654 1.0670 1.0675 2.5795 2.5788 1.4649 1.6878 1.2937 1.3223 1.7991 1.8196 1.8150 1.2206 1.4007 1.3647 1.6343 1.3732 1.8687 6.1755 6.2064 2.2432 2.3005 1.1153 1.1308 1.2748 1.3736 2.0958 1.9048 6.7195 6.6836 7.1653 7.1784 1.0776 1.0717 1.0665 1.0670 1.0707 1.0805 1.0948 1.0931 1.0948 1.0959 1.0852 1.0852 1.0895 1.0895 1.0943 1.0943 1.1003 1.1003
irintensity: 0.0186 0.0211 0.0048 0.0000 0.0000 0.0581 0.0000 12.8735 0.0000 0.0000 3.7984 2.3573 0.0000 14.3487 0.0000 0.1716 0.0000 6.0815 0.0000 0.0000 1.1599 0.0000 5.7481 0.0010 0.0000 141.4534 0.0001 0.0000 21.8924 0.0000 1.4201 0.0000 0.0000 0.7228 6.2574 0.0000 0.9636 0.8817 0.0000 0.0091 0.0151 15.8650 0.0000 13.5955 0.0953 0.0000 0.0000 9.0492 0.0000 0.0000 0.1329 0.0000 5.5706 0.1297 0.0014 0.7078 0.0000 0.0000 0.3362 15.4292 0.0000 0.0000 12.2055 0.0000 0.6733 0.0000 5.1423 12.8773 0.0000 0.0000 5.5436 0.0000 3.4117 0.0000 0.0000 19.7329 25.5506 0.0000 40.6211 0.0000 3.3811 0.0000 0.0000 0.6875 0.0000 49.4964 0.0009 50.8466 0.0000 65.8455 0.0001 45.4531 0.0003 74.1387 0.1143 8.5233 6.4944 0.0851 0.5486 71.6482 81.1650 0.0460
temp: 298.150 k
press: 1.00000 atm
elementType: 6 6 6 6 6 6 6 6 6 6 6 6 6 6 6 6 6 6 1 1 1 1 1 1 1 1 1 1 1 1 1 1 1 1 1 1
symmnumber: 1
zpe: 797505.9 jmol-1
zpe.correction: 0.303754 hartree
zpe.thermalcorrener: 0.317908 hartree
zpe.thermalcorrenthalpy: 0.318852 hartree
zpe.thermalcorrgfe: 0.262137 hartree
zpe.sumelectzpe: -695.461760 hartree
zpe.sumelectthermal: -695.447606 hartree
zpe.sumelectthermalent: -695.446662 hartree
zpe.sumelectthermalfe: -695.503377 hartree
dipole: 0.0000 0.0000 0.0000
dipole: 0.0000
quadrupole: -105.2845 -96.6167 -111.9097
quadrupole: 0.0000 -0.3077 0.0000
quadrupole: -0.6808 7.9869 -7.3061 0.0000 -0.3077 0.0000
hfenergy: -695.7655141 hartree
pointgroup: C01 [X(C18H18)]
dipole: -0.0000016 0.000001 0.0000013 debye
polarizability: 267.8318273|0.000241|185.7023371|4.3415805|-0.0012293|95.2830574 unknown
InChI: InChI=1S/C18H18/c1-2-6-14-10-17(9-13(14)5-1)18-11-15-7-3-4-8-16(15)12-18/h1-8,17-18H,9-12H2
charge 0 multiplicity 1
36 atoms
C  -0.713024 -0.000048 -0.287303
C  0.713014 -0.000039 0.287297
C  -1.579543 -1.233897 0.132318
C  -1.579557 1.233789 0.132317
C  1.579536 -1.233895 -0.13229
C  1.57954 1.233791 -0.132353
C  -3.00695 -0.710448 0.051155
C  -3.006959 0.710328 0.051153
C  3.006941 -0.710438 -0.051145
C  3.006946 0.710339 -0.051182
C  -4.220484 -1.425243 0.006995
C  -4.220501 1.425108 0.006987
C  4.220479 -1.425227 -0.006972
C  4.220485 1.425125 -0.007042
C  -5.442058 -0.707881 -0.043142
C  -5.442066 0.707731 -0.043149
C  5.442049 -0.707858 0.043142
C  5.442053 0.707753 0.043108
H  -0.644603 -0.000044 -1.396547
H  0.644589 -0.000007 1.396541
H  -1.337173 -1.531629 1.175347
H  -1.399819 -2.119136 -0.504533
H  -1.399848 2.119035 -0.50453
H  -1.337191 1.531522 1.175348
H  1.337167 -1.531656 -1.175311
H  1.399818 -2.119118 0.504584
H  1.39983 2.11905 0.504475
H  1.337171 1.531503 -1.175389
H  -4.224926 -2.521804 0.005346
H  -4.224958 2.521669 0.005329
H  4.224923 -2.521789 -0.005293
H  4.224936 2.521686 -0.005416
H  -6.393105 -1.251128 -0.086126
H  -6.39312 1.250965 -0.086135
H  6.3931 -1.251099 0.086138
H  6.393106 1.250992 0.086078
