program: Gaussian 09
title: 000142335
version: EM64L-G09RevD.01
frameworkgroup: C1[X(C12H18)]
method: RPBEPBE
basis: SDD
operation: Freq
keyword: #p
keyword: freq=noraman
keyword: PBEPBE/SDD
title: #p freq=noraman PBEPBE/SDD
converged: NO YES NO NO
title: Mulliken charges:
elementType: C C C C C C C C C C C C H H H H H H H H H H H H H H H H H H
charge: 0.279302 0.279300 -0.536903 -0.512593 -0.512587 -0.536899 -0.325641 -0.325642 -0.383985 -0.384832 -0.384832 -0.383983 0.200211 0.208741 0.208563 0.215789 0.208562 0.215787 0.200210 0.208741 0.249076 0.249077 0.197908 0.194637 0.200052 0.189671 0.200052 0.189671 0.197908 0.194637
chargesum: 0.00000
title: Mulliken charges with hydrogens summed into heavy atoms:
elementType: C C C C C C C C C C C C
charge: 0.279302 0.279300 -0.127950 -0.088241 -0.088238 -0.127947 -0.076565 -0.076565 0.008560 0.004891 0.004890 0.008562
polarizability: 1.18182253e+02 -1.27742003e+00 1.20930707e+02 -2.52994227e-04 2.62602412e-04 1.10683817e+02
1716.lowfreq: -18.6175 -12.1096 -0.0009 -0.0006 0.0006 15.1221 67.7665 127.6594 146.0290
frequency: 67.5446 127.6591 145.9610 235.5028 288.9637 305.3516 334.2794 352.5885 380.8646 401.5213 402.3165 471.3672 489.8204 510.6774 572.2243 610.9691 631.4352 748.2333 768.7691 795.6901 835.8139 862.0927 863.2197 882.8272 900.3863 909.0968 925.9467 952.6094 964.0627 987.0363 999.6975 1015.2462 1016.7688 1054.0285 1087.7963 1092.7575 1106.5450 1118.5995 1140.9758 1152.6573 1160.0781 1171.3675 1199.4193 1240.9438 1245.9853 1265.1188 1271.6588 1297.7458 1302.5628 1333.7350 1334.1832 1334.8079 1338.3985 1339.5245 1343.8500 1346.6277 1351.6827 1453.1119 1455.8422 1463.2510 1463.8800 1465.9184 1472.5877 1479.8900 1480.5618 1569.2101 2947.3951 2947.8385 2959.3501 2960.3245 2968.8948 2969.9570 2970.5207 2970.5830 3003.6950 3004.9219 3019.3053 3019.9266 3027.9492 3027.9683 3035.6839 3038.3106 3121.6022 3163.0305
redmass: 2.5891 2.4190 2.2780 2.3484 3.0600 2.0405 2.2153 1.9306 2.3999 2.5084 2.4213 2.8726 2.1980 2.0332 2.7991 2.7651 2.8959 1.4371 1.5270 1.6484 2.5503 2.1994 2.5520 1.6015 1.5135 1.6290 2.2084 1.8989 1.9730 2.1270 2.2718 2.2545 1.1830 1.7387 1.3946 2.8838 1.7388 2.1592 2.6061 1.4804 1.2834 2.2432 1.5417 1.4766 1.5663 1.3080 1.2545 2.2152 1.7329 1.3916 1.3484 1.3408 1.4338 1.4683 1.3715 1.4241 1.4302 1.0848 1.0841 1.0888 1.0897 1.0874 1.0875 1.0836 1.0852 5.9424 1.0606 1.0605 1.0620 1.0618 1.0631 1.0631 1.0623 1.0627 1.0975 1.0978 1.0998 1.0984 1.1000 1.0983 1.1035 1.1031 1.0844 1.1180
irintensity: 0.0409 0.0036 0.1225 0.0017 0.0321 0.1987 3.0696 0.2277 0.3188 1.5123 0.0146 2.4461 1.1113 0.8437 0.3227 0.6190 0.6805 60.6687 1.9938 8.4967 9.5065 22.1082 1.2582 0.4293 12.9138 0.4743 0.6019 0.2315 0.1264 2.4237 4.3722 3.7384 2.4797 0.2172 0.4043 1.6333 0.1226 0.2261 2.1532 4.6061 0.9654 0.1424 1.1088 1.9879 2.1598 0.2547 0.8391 0.8739 5.5943 2.7735 0.1110 0.9727 0.3846 0.2112 0.1763 0.3081 0.0001 0.0088 8.3447 12.9467 2.0276 0.6789 22.1433 17.5593 3.7482 2.1691 45.6166 21.5853 0.8614 49.6952 83.5752 0.6425 74.4138 0.3641 92.7440 14.7764 9.6358 56.8470 111.7663 15.1553 35.0553 130.5322 13.5853 33.9421
temp: 298.150 k
press: 1.00000 atm
elementType: 6 6 6 6 6 6 6 6 6 6 6 6 1 1 1 1 1 1 1 1 1 1 1 1 1 1 1 1 1 1
symmnumber: 1
zpe: 704894.2 jmol-1
zpe.correction: 0.268480 hartree
zpe.thermalcorrener: 0.278974 hartree
zpe.thermalcorrenthalpy: 0.279918 hartree
zpe.thermalcorrgfe: 0.233311 hartree
zpe.sumelectzpe: -467.087208 hartree
zpe.sumelectthermal: -467.076714 hartree
zpe.sumelectthermalent: -467.075770 hartree
zpe.sumelectthermalfe: -467.122377 hartree
dipole: 0.0000 0.0000 -0.3378
dipole: 0.3378
quadrupole: -74.9181 -72.9082 -73.8698
quadrupole: -0.1918 0.0000 0.0000
quadrupole: -1.0194 0.9905 0.0289 -0.1918 0.0000 0.0000
hfenergy: -467.3556878 hartree
pointgroup: C01 [X(C12H18)]
dipole: 0.0000053 -0.0000012 -0.1328872 debye
polarizability: 118.1099014|-1.1948696|121.0030586|0.0002452|-0.0002699|110.6838173 unknown
InChI: InChI=1S/C12H18/c1-2-6-12-8-4-3-7-11(12,5-1)9-10-12/h9-10H,1-8H2
charge 0 multiplicity 1
30 atoms
C  0.010276 0.818361 0.339022
C  -0.010288 -0.818327 0.339063
C  -1.107624 1.54706 -0.448176
C  1.395243 1.452943 -0.042907
C  -1.395254 -1.452916 -0.042843
C  1.107615 -1.547061 -0.448093
C  -0.087241 0.676335 1.876332
C  0.087231 -0.676224 1.876368
C  -2.44346 0.783261 -0.565938
C  2.190565 0.645723 -1.09187
C  -2.190539 -0.645763 -1.091885
C  2.443459 -0.783276 -0.565843
H  -0.733455 1.733345 -1.477581
H  -1.270035 2.545925 0.006976
H  2.025901 1.529978 0.864171
H  1.226635 2.489508 -0.398578
H  -2.025934 -1.529865 0.864227
H  -1.226656 -2.489513 -0.398424
H  0.733464 -1.733371 -1.477501
H  1.270008 -2.545915 0.007087
H  -0.184059 1.430193 2.664661
H  0.184056 -1.43004 2.664735
H  -3.123528 1.337653 -1.241795
H  -2.945222 0.723249 0.421292
H  3.147608 1.161794 -1.30313
H  1.63478 0.594485 -2.051738
H  -3.147568 -1.161852 -1.303161
H  -1.634711 -0.594571 -2.051731
H  3.123552 -1.337701 -1.241646
H  2.945179 -0.72322 0.421405
