program: Gaussian 09
title: 000142309
version: EM64L-G09RevD.01
frameworkgroup: C1[X(C20H22N2)]
method: RPBEPBE
basis: SDD
operation: Freq
keyword: #pfreq=noraman
keyword: PBEPBE/SDD
title: #p freq=noraman PBEPBE/SDD
converged: YES YES NO NO
title: Mulliken charges:
elementType: N N C C C C C C C C C C C C C C C C C C C C H H H H H H H H H H H H H H H H H H H H H H
charge: 0.034997 0.034995 0.251476 0.251477 -0.610884 -0.590645 -0.568568 -0.568567 -0.590645 -0.522316 0.410239 0.410239 -0.384727 -0.384726 -0.417788 -0.417789 -0.263261 -0.263260 -0.244987 -0.244987 -0.242733 -0.242733 0.238088 0.238087 0.235694 0.233973 0.243640 0.239586 0.243641 0.239584 0.235696 0.233971 0.244312 0.244312 0.224415 0.224415 0.246675 0.246675 0.224025 0.224025 0.223492 0.223492 0.228698 0.228698
chargesum: 0.00000
title: Mulliken charges with hydrogens summed into heavy atoms:
elementType: N N C C C C C C C C C C C C C C C C C C C C
charge: 0.034997 0.034995 0.251476 0.251477 -0.134709 -0.120978 -0.085342 -0.085343 -0.120978 -0.033693 0.410239 0.410239 -0.160312 -0.160311 -0.171114 -0.171114 -0.039235 -0.039236 -0.021495 -0.021495 -0.014035 -0.014035
polarizability: 2.77709930e+02 2.63175861e-04 1.94511240e+02 1.75430537e+01 2.78465993e-04 1.78649863e+02
1716.lowfreq: -10.4623 -0.0009 0.0003 0.0005 3.4715 10.8156 36.3545 37.7210 52.5478
frequency: 36.3436 37.5503 52.5429 98.5404 131.1025 132.8795 227.8035 253.2355 259.9779 278.6471 289.9825 295.5912 362.2957 394.4535 400.9803 401.7972 421.4551 422.3749 440.1812 440.9089 470.1799 508.6149 525.3667 545.6599 572.6711 617.1936 617.6306 631.4820 634.8920 667.8873 704.3976 704.8319 746.2575 759.8655 778.2850 782.8158 810.2148 843.6177 849.3440 849.8823 873.9481 884.4811 890.7330 909.2023 912.0742 924.8993 952.9939 968.3707 973.2252 973.3930 989.3634 989.9399 993.3341 993.3449 1000.3556 1002.6295 1019.0166 1021.6900 1026.8057 1032.5876 1040.3412 1048.6190 1065.9367 1087.7890 1088.6568 1168.3774 1169.7261 1173.6579 1173.7214 1189.1113 1198.6477 1200.9164 1207.9918 1218.9586 1242.1977 1287.5184 1290.8416 1293.0525 1300.6842 1300.9746 1317.5199 1324.0825 1328.8695 1329.0937 1334.5824 1345.1642 1345.3874 1352.9450 1376.5197 1376.8011 1434.1105 1434.1378 1441.0627 1444.4245 1449.9623 1455.0284 1457.0896 1474.5518 1486.9696 1488.2306 1586.9955 1587.2169 1612.2782 1612.9994 2972.4445 2973.2554 2976.1121 2983.9127 2987.1119 3009.1259 3032.6127 3038.5395 3041.0689 3050.8232 3052.6186 3079.8176 3116.0926 3116.0947 3124.8822 3124.8958 3138.0820 3138.0877 3150.7611 3150.7680 3163.8022 3163.9171
redmass: 3.9588 3.8455 4.6947 3.9650 3.8450 3.7804 4.5664 2.8288 4.4616 4.6209 3.1720 2.6568 2.6819 2.9421 2.7962 2.8445 4.3406 2.4978 2.3370 4.4441 1.8513 1.7238 3.0675 2.8558 3.8367 6.3770 6.3312 5.0555 5.2150 6.8931 1.6615 1.6716 3.0396 2.1244 2.4911 3.5709 3.9372 4.5873 1.2520 1.2773 3.0196 1.7985 1.7550 1.4389 1.4944 2.0237 2.9088 2.8019 1.3983 1.4457 6.0081 6.0781 1.3320 1.3424 2.5074 4.6697 2.6490 2.9193 3.3468 2.1057 2.1190 2.7620 2.2129 1.6754 1.6015 1.0432 3.2797 1.0538 1.0513 3.3463 1.3023 1.1787 2.8426 2.8793 3.3200 1.4151 1.2405 1.4079 1.3108 1.2046 1.3051 1.3360 1.4013 1.3768 1.3083 1.1958 1.3583 1.4287 5.4681 5.7918 2.1916 2.2705 1.0823 1.1097 1.0916 1.0980 1.1037 1.0963 2.1153 2.1162 5.7547 5.7559 5.9663 5.9425 1.0579 1.0588 1.0583 1.0587 1.0597 1.0598 1.1029 1.1052 1.1045 1.1054 1.1054 1.1080 1.0855 1.0855 1.0865 1.0865 1.0927 1.0927 1.0946 1.0946 1.1009 1.1009
irintensity: 0.0729 0.0467 0.0414 0.0243 0.1536 0.1841 0.7200 0.5436 0.3852 0.0813 0.2563 0.0282 0.7211 0.6540 0.1842 0.0255 0.0513 2.9650 0.9628 0.0395 1.1681 0.6281 12.4791 17.2651 28.3086 0.0367 1.3878 2.5694 3.9335 10.8186 52.8981 48.1082 23.4389 60.9117 27.0320 8.6448 31.4500 3.8089 0.0484 0.3825 1.5246 0.2385 0.6393 0.1364 0.4926 2.8931 31.9619 51.3848 0.3737 2.1209 0.3732 0.3489 1.2840 1.2886 14.5183 19.9768 1.2044 25.0324 14.1325 36.5705 7.4356 0.3523 28.5635 10.6752 0.7460 0.1062 20.6222 0.0679 0.0052 11.1487 7.5211 0.1767 15.0686 1.5118 0.0085 0.5371 2.5977 6.6577 8.1581 0.2549 1.3188 0.2498 1.2577 0.9438 0.3080 0.0703 0.3529 0.1688 0.1158 0.2004 2.5189 9.7039 9.1119 4.9461 19.6977 28.7347 6.6767 2.4903 41.4332 17.3209 5.4529 0.2265 32.1042 8.5085 4.0152 96.6500 21.9792 96.7278 4.4719 66.1327 5.2582 8.6370 39.1003 18.0115 47.8652 34.7110 7.2616 13.6788 0.0887 0.2144 54.0071 0.1897 37.5271 36.2020 36.9795 5.7677
temp: 298.150 k
press: 1.00000 atm
elementType: 7 7 6 6 6 6 6 6 6 6 6 6 6 6 6 6 6 6 6 6 6 6 1 1 1 1 1 1 1 1 1 1 1 1 1 1 1 1 1 1 1 1 1 1
symmnumber: 1
zpe: 981300.8 jmol-1
zpe.correction: 0.373758 hartree
zpe.thermalcorrener: 0.390403 hartree
zpe.thermalcorrenthalpy: 0.391347 hartree
zpe.thermalcorrgfe: 0.329562 hartree
zpe.sumelectzpe: -883.225630 hartree
zpe.sumelectthermal: -883.208985 hartree
zpe.sumelectthermalent: -883.208040 hartree
zpe.sumelectthermalfe: -883.269826 hartree
dipole: 0.0000 -1.2699 0.0000
dipole: 1.2699
quadrupole: -121.5897 -133.7715 -129.7931
quadrupole: 0.0001 4.0624 0.0000
quadrupole: 6.7950 -5.3867 -1.4083 0.0001 4.0624 0.0000
hfenergy: -883.5993876 hartree
pointgroup: C01 [X(C20H22N2)]
dipole: -0.0000075 0.4996276 -0.0000057 debye
polarizability: 277.316382|0.0015032|194.5112404|-18.6168931|-0.0006674|179.043411 unknown
InChI: InChI=1S/C20H22N2/c1-3-7-17(8-4-1)19-11-20(18-9-5-2-6-10-18)14-21(12-19)16-22(13-19)15-20/h1-10H,11-16H2
charge 0 multiplicity 1
44 atoms
N  -0.028421 -2.293003 -1.241743
N  0.028494 -2.292994 1.241761
C  1.292077 -0.502785 -0.029452
C  -1.292066 -0.502829 0.029454
C  -0.00001 0.378615 -0.000002
C  1.194894 -1.437133 -1.283228
C  -1.25414 -1.445121 -1.233139
C  1.254184 -1.44507 1.233148
C  -1.194851 -1.437164 1.283238
C  0.00005 -3.122469 0.000009
C  2.554919 0.363588 -0.013427
C  -2.554937 0.363502 0.013422
C  2.767794 1.289354 1.046814
C  -2.767822 1.289279 -1.046807
C  3.55684 0.26913 -1.015666
C  -3.556868 0.269002 1.015648
C  3.930265 2.086215 1.103963
C  -3.930315 2.086107 -1.103961
C  4.722695 1.067485 -0.963654
C  -4.722746 1.067325 0.96363
C  4.917168 1.979878 0.095936
C  -4.91723 1.979727 -0.09595
H  0.003954 1.040773 0.887856
H  -0.003998 1.040768 -0.887864
H  1.17041 -0.83723 -2.213619
H  2.072384 -2.110251 -1.331926
H  -2.141545 -2.106218 -1.234357
H  -1.278959 -0.845129 -2.161971
H  2.141611 -2.106136 1.23437
H  1.278984 -0.845068 2.161976
H  -1.170385 -0.837252 2.213623
H  -2.072319 -2.11031 1.331941
H  -0.900281 -3.761516 0.019579
H  0.900403 -3.761485 -0.019553
H  2.016788 1.393699 1.839302
H  -2.016806 1.39366 -1.839281
H  3.437125 -0.427506 -1.8512
H  -3.437144 -0.42764 1.851174
H  4.067019 2.789946 1.93309
H  -4.067077 2.789848 -1.933079
H  5.47857 0.975218 -1.752195
H  -5.478629 0.975025 1.752159
H  5.820642 2.598372 0.137414
H  -5.820721 2.598195 -0.137432
