program: Gaussian 09
title: 000142297
version: EM64L-G09RevD.01
frameworkgroup: C1[X(C11H15Cl)]
method: RPBEPBE
basis: SDD
operation: Freq
keyword: #p
keyword: freq=noraman
keyword: PBEPBE/SDD
title: #p freq=noraman PBEPBE/SDD
converged: YES YES NO NO
title: Mulliken charges:
elementType: Cl C C C C C C C C C C C H H H H H H H H H H H H H H H
charge: -0.098338 0.129155 0.506640 -0.698162 -0.696494 -0.747557 -0.548987 -0.402748 0.541584 -0.251033 -0.386674 -0.785213 0.209927 0.214829 0.222297 0.214549 0.209038 0.226549 0.219805 0.215188 0.221336 0.255500 0.231944 0.226595 0.239095 0.264237 0.266937
chargesum: 0.00000
title: Mulliken charges with hydrogens summed into heavy atoms:
elementType: Cl C C C C C C C C C C C
charge: -0.098338 0.129155 0.506640 -0.051109 -0.046358 -0.091229 -0.293487 -0.170803 0.541584 -0.024437 -0.147579 -0.254039
polarizability: 1.63700149e+02 -2.81484088e+00 1.27960302e+02 -2.14933852e+00 3.21285219e+00 9.07613411e+01
1716.lowfreq: -6.5404 -0.0027 -0.0023 0.0008 6.3393 11.2346 31.0561 39.0830 103.6564
frequency: 30.5752 38.8576 103.6545 126.9163 186.3470 196.7775 246.3838 251.6903 283.3632 311.1438 313.3199 337.0999 356.5242 379.7284 442.3642 463.1037 520.4937 538.2272 566.2161 664.0346 686.6343 710.1074 804.8220 816.0565 886.5813 911.7812 921.6654 923.3682 926.8862 932.4908 942.6634 985.8770 991.0787 1020.3910 1025.8584 1090.5129 1108.3215 1134.4400 1189.2983 1205.2964 1213.4783 1225.1968 1242.5474 1285.8302 1314.3549 1375.9241 1377.4262 1382.9576 1405.5512 1430.7700 1459.6157 1461.5756 1464.4665 1465.7936 1476.6822 1486.2985 1488.2779 1497.8179 1594.2504 1613.1853 2972.6000 2973.5947 2978.7065 3064.2481 3068.0700 3069.1935 3070.1580 3077.2123 3078.7885 3080.9173 3122.8637 3134.5205 3145.2735 3148.4059 3156.9103
redmass: 3.2038 6.0078 6.3806 2.8655 2.4831 1.1214 1.3617 2.2412 2.8879 2.2279 1.1657 2.7890 2.4273 2.3998 3.3671 2.9694 3.1016 4.1820 6.6690 5.0085 5.4427 1.7953 2.7010 1.7746 1.9096 1.6865 1.5896 1.4872 1.7713 1.7559 1.2066 1.3680 5.8526 1.4141 1.3820 1.7143 1.4274 1.2354 1.0902 2.9800 2.8450 2.1982 1.1471 3.6582 1.3006 1.1866 1.3829 4.3290 1.2073 2.9423 1.0510 1.1338 1.0820 1.1342 1.2277 1.5209 1.0511 1.0880 5.8838 6.1133 1.0351 1.0347 1.0359 1.0575 1.1002 1.1001 1.1004 1.0990 1.0990 1.0993 1.0855 1.0916 1.1081 1.0939 1.0988
irintensity: 0.1346 1.6231 1.8607 0.6340 0.7134 0.0447 0.8584 2.1977 2.2526 0.4429 0.0687 0.1405 0.6973 0.2403 1.5414 1.5874 1.9767 7.1226 72.8152 16.5022 3.3368 40.0331 11.1939 23.0817 1.4884 0.7326 6.9205 0.7806 4.6385 4.7516 0.1428 0.1850 0.2260 1.7526 0.1695 9.1628 1.0428 0.3521 0.1665 6.2393 31.8646 36.1105 25.6046 17.4587 0.1368 19.6958 25.5185 1.0598 9.1696 7.7515 0.0185 6.5735 0.9825 1.1634 15.9309 6.0236 12.4069 29.0285 4.8897 8.4550 31.0964 33.1656 24.9202 23.3917 1.2778 13.6907 10.7865 71.7391 79.5450 44.2663 1.0533 22.3291 3.2903 19.3207 17.7323
temp: 298.150 k
press: 1.00000 atm
elementType: 17 6 6 6 6 6 6 6 6 6 6 6 1 1 1 1 1 1 1 1 1 1 1 1 1 1 1
symmnumber: 1
zpe: 597979.8 jmol-1
zpe.correction: 0.227758 hartree
zpe.thermalcorrener: 0.240544 hartree
zpe.thermalcorrenthalpy: 0.241488 hartree
zpe.thermalcorrgfe: 0.187921 hartree
zpe.sumelectzpe: -887.325832 hartree
zpe.sumelectthermal: -887.313046 hartree
zpe.sumelectthermalent: -887.312102 hartree
zpe.sumelectthermalfe: -887.365670 hartree
dipole: -2.3818 1.0163 -1.4747
dipole: 2.9800
quadrupole: -83.0863 -76.2203 -81.6126
quadrupole: 5.0186 -6.3889 2.7002
quadrupole: -2.7799 4.0861 -1.3062 5.0186 -6.3889 2.7002
hfenergy: -887.5535903 hartree
pointgroup: C01[X(C11H15Cl1)]
dipole: -0.8602941 0.4571116 -0.652334 debye
polarizability: 162.611317|-6.840694|129.328562|1.7201613|0.2525132|90.4819136 unknown
InChI: InChI=1S/C11H15Cl/c1-11(2,3)10-6-4-5-9(7-10)8-12/h4-7H,8H2,1-3H3
charge 0 multiplicity 1
27 atoms
Cl 3.696922 -1.587036 0.901264
C  -2.12815 -0.466775 0.02468
C  -0.719833 0.171364 -0.032896
C  -3.051045 0.223027 -1.025072
C  -2.725319 -0.261841 1.45028
C  -2.102365 -1.987354 -0.276323
C  0.447681 -0.572371 -0.324559
C  -0.565869 1.564508 0.216108
C  1.731714 0.033132 -0.367907
C  0.701699 2.181724 0.176789
C  1.854598 1.420569 -0.113378
C  2.942455 -0.788944 -0.686464
H  -4.067016 -0.212677 -0.983897
H  -3.140675 1.308534 -0.841009
H  -2.655744 0.084509 -2.048138
H  -2.8079 0.808757 1.709946
H  -3.738228 -0.702892 1.505334
H  -2.092841 -0.748084 2.215273
H  -3.129694 -2.391692 -0.223809
H  -1.712883 -2.198715 -1.289663
H  -1.487218 -2.540866 0.456983
H  0.377124 -1.647899 -0.517428
H  -1.445418 2.178072 0.443292
H  0.790354 3.256188 0.372139
H  2.842286 1.895938 -0.137414
H  3.774573 -0.198118 -1.094671
H  2.726992 -1.657459 -1.324959
