program: Gaussian 09
title: 000142262
version: EM64L-G09RevD.01
frameworkgroup: C1[X(C6H12O)]
method: RPBEPBE
basis: SDD
operation: Freq
keyword: #pfreq=noraman
keyword: PBEPBE/SDD
title: #p freq=noraman PBEPBE/SDD
converged: YES YES NO NO
title: Mulliken charges:
elementType: O C C C C C C H H H H H H H H H H H H
charge: -0.435000 -0.062911 -0.484777 -0.500200 -0.432532 -0.133570 -0.704873 0.225555 0.227660 0.224436 0.210592 0.229200 0.222409 0.210907 0.219174 0.198618 0.237828 0.225990 0.321493
chargesum: 0.00000
title: Mulliken charges with hydrogens summed into heavy atoms:
elementType: O C C C C C C
charge: -0.113508 0.162644 -0.032681 -0.060408 0.000784 0.085604 -0.042437
polarizability: 7.42869794e+01 2.01479784e-01 6.66378060e+01 1.35524907e+00 -9.23525314e-01 5.82357053e+01
1716.lowfreq: -14.4918 -0.0004 0.0002 0.0009 17.5438 25.9956 87.4856 117.6282 164.8134
frequency: 87.3290 117.5640 164.8013 233.0735 286.1402 316.5432 336.8880 437.0082 475.6732 634.8958 755.8010 780.5890 842.4201 874.1212 927.0096 938.7965 957.5406 978.9185 1015.8500 1037.5556 1066.7386 1108.6016 1175.1984 1177.1904 1193.9375 1215.3632 1234.0415 1239.3797 1248.9227 1258.0230 1297.5111 1357.6626 1370.5448 1381.8464 1455.4283 1462.1726 1467.6402 1470.7863 1479.9832 2967.3979 2971.0708 3000.5191 3013.3798 3020.5496 3024.7734 3065.0723 3071.6751 3082.1129 3089.9409 3100.9422 3540.1415
redmass: 2.8691 1.9643 2.8596 1.0752 1.1411 2.8097 2.0357 3.3852 2.9156 1.8286 1.4743 1.2058 2.5690 2.2949 1.7907 2.1125 1.5715 1.4929 2.5310 1.7466 2.5881 2.2619 1.6151 1.4154 1.4054 1.1536 1.4360 1.3879 1.4164 1.5480 1.3312 1.6058 1.1605 1.2261 1.0862 1.0832 1.0541 1.0505 1.1289 1.0778 1.0433 1.0594 1.0576 1.0674 1.0846 1.0977 1.1051 1.1064 1.0994 1.1066 1.0658
irintensity: 1.4347 0.3009 0.4814 7.0868 86.5363 23.7048 29.9392 6.2106 10.3389 7.9282 2.9962 2.4300 16.7073 4.2490 2.7045 12.3481 0.2338 16.2171 36.3014 39.8609 23.1886 5.9284 9.4195 6.2975 1.7966 0.1820 12.0515 3.5567 5.8581 2.8900 9.4910 4.3506 28.9775 22.9337 8.0801 5.4459 7.9907 10.1758 3.5293 11.9221 30.6095 47.2354 48.9695 21.5781 22.5673 49.3636 15.6369 21.8532 30.3963 95.6423 4.5407
temp: 298.150 k
press: 1.00000 atm
elementType: 8 6 6 6 6 6 6 1 1 1 1 1 1 1 1 1 1 1 1
symmnumber: 1
zpe: 441464.3 jmol-1
zpe.correction: 0.168145 hartree
zpe.thermalcorrener: 0.176231 hartree
zpe.thermalcorrenthalpy: 0.177175 hartree
zpe.thermalcorrgfe: 0.135981 hartree
zpe.sumelectzpe: -310.441203 hartree
zpe.sumelectthermal: -310.433117 hartree
zpe.sumelectthermalent: -310.432172 hartree
zpe.sumelectthermalfe: -310.473367 hartree
dipole: -0.6043 1.4405 1.2844
dipole: 2.0224
quadrupole: -46.5008 -47.3545 -41.4888
quadrupole: 2.6070 2.9265 -2.6895
quadrupole: -1.3861 -2.2398 3.6259 2.6070 2.9265 -2.6895
hfenergy: -310.6093478 hartree
pointgroup: C01 [X(C6H12O1)]
dipole: 0.2428839 0.5840335 -0.482691 debye
dipolederiv: -0.8050258 -0.1099365 0.0025589 -0.1108522 -0.7442798 -0.1288533 0.0284744 -0.1370448 -0.1263976 -0.0705046 -0.0327606 -0.0434798 0.0215174 -0.0732536 -0.0294199 0.060185 -0.0041416 0.1494387 -0.0538509 0.018673 -0.0309585 0.0254299 0.0552486 0.0750647 -0.0199853 0.0137359 0.131283 -0.0716982 -0.0099195 -0.0329068 0.0119085 0.0553701 -0.0830985 -0.0269038 -0.0142189 0.1335311 0.0729417 -0.0084363 0.0549212 -0.0164911 -0.0297866 -0.0105181 0.0093192 -0.0115744 0.1826221 0.5829395 0.0910898 0.0402989 0.0739516 0.5928937 0.0943415 -0.0322103 0.1001562 0.2639659 -0.1175442 0.1237592 -0.0231266 0.069409 -0.158998 0.0085408 0.0149711 0.0383176 0.0905134 -0.0009079 -0.000888 -0.0628245 0.0049631 0.0513254 0.0088195 -0.0559488 0.0086134 -0.1875256 0.0409944 0.0249539 0.0110517 0.0373195 -0.1210145 -0.101461 0.0247263 -0.1431871 -0.0050582 0.0631103 -0.0364032 0.0557278 -0.0226924 0.026246 0.0490559 0.0343807 0.0998451 -0.1145107 0.0533181 0.0367671 0.0690908 0.0221863 0.0323268 -0.0402378 0.0514241 -0.0954511 -0.1377835 0.0500414 -0.0086567 0.0022188 -0.0251421 -0.1557529 0.0870357 0.0092622 0.1273143 0.0131342 -0.1123876 0.0025557 -0.1116317 0.0056102 0.0643539 0.0014717 -0.1754253 0.0000634 -0.0525635 -0.028495 -0.0048198 0.0888077 -0.0078323 0.0594794 0.0113786 0.1499075 0.013021 -0.1088058 0.0184013 -0.0112012 -0.0635284 -0.0033528 0.0048424 0.0203886 -0.0324273 0.0001474 -0.1462677 0.0839839 0.020341 -0.0001518 0.0026885 0.069041 -0.0290629 -0.0612046 0.0272366 -0.1743467 -0.1478018 0.0298454 0.0823767 -0.0011034 0.0898296 0.019879 0.094447 0.0067675 0.0478465 0.0648144 -0.1069394 -0.0440202 -0.0861352 -0.1032196 -0.0532542 -0.0364539 -0.0627982 0.0702978 0.377671 -0.0180241 0.0055757 -0.0013824 0.2853481 0.0999299 -0.0365384 0.0331976 -0.0293733 unknown
polarizability: 74.2536133|-0.2551209|66.5638039|1.5336095|1.2088972|58.3430736 unknown
InChI: InChI=1S/C6H12O/c1-5(7)6-3-2-4-6/h5-7H,2-4H2,1H3
charge 0 multiplicity 1
19 atoms
O  -1.857054 -1.320109 -0.036629
C  0.203779 0.018638 -0.391266
C  1.265611 -1.070352 -0.00709
C  1.21656 1.123037 0.090598
C  2.36157 0.051677 0.033644
C  -1.172402 -0.042843 0.283105
C  -2.064351 1.163173 -0.064173
H  0.070346 0.068984 -1.492535
H  1.416164 -1.903156 -0.712526
H  1.05674 -1.492416 0.992181
H  1.000791 1.43984 1.128373
H  1.328163 2.022539 -0.537386
H  3.072773 0.032259 0.875715
H  2.932808 0.10873 -0.909851
H  -1.037155 -0.107365 1.378926
H  -2.225523 1.232567 -1.158119
H  -3.048024 1.06822 0.42742
H  -1.597189 2.109081 0.267381
H  -2.020007 -1.344704 -1.015068
