program: Gaussian 09
title: 000142242
version: EM64L-G09RevD.01
frameworkgroup: C1[X(C11H18)]
method: RPBEPBE
basis: SDD
operation: Freq
keyword: #p
keyword: freq=noraman
keyword: PBEPBE/SDD
title: #p freq=noraman PBEPBE/SDD
converged: YES YES NO NO
title: Mulliken charges:
elementType: C C C C C C C C C C C H H H H H H H H H H H H H H H H H H
charge: -0.006252 -0.006227 -0.133394 -0.133400 -0.480110 -0.480865 -0.480861 -0.480108 -0.579702 -0.579703 -0.381610 0.193216 0.193219 0.198569 0.198566 0.210191 0.210851 0.202732 0.217783 0.202732 0.217781 0.210191 0.210851 0.225654 0.204791 0.225683 0.204769 0.207327 0.207329
chargesum: 0.00000
title: Mulliken charges with hydrogens summed into heavy atoms:
elementType: C C C C C C C C C C C
charge: 0.186963 0.186991 0.065174 0.065166 -0.059068 -0.060350 -0.060348 -0.059066 -0.149257 -0.149251 0.033046
polarizability: 1.19032629e+02 -7.88551688e-05 1.03879201e+02 1.56472516e-04 2.93690699e-01 9.84183460e+01
1716.lowfreq: -34.2942 -23.7662 -16.3649 -0.0007 0.0002 0.0003 107.6507 169.6403 203.2909
frequency: 107.4430 169.6087 203.2819 227.8800 278.2768 328.7041 341.7561 458.3948 468.6472 503.8453 505.3707 607.2481 644.4140 739.9433 761.2500 792.7063 811.9820 842.2577 843.6842 850.3147 871.8606 872.5159 923.4664 938.1130 955.4454 979.3655 1013.2346 1021.1688 1034.4630 1051.2783 1060.7703 1101.2327 1114.5779 1114.6446 1125.0733 1137.1827 1156.2723 1176.5952 1180.0684 1216.1773 1218.1086 1230.4829 1242.8291 1255.3413 1259.5110 1274.4981 1279.8079 1288.3407 1300.2176 1316.0227 1316.2330 1318.2206 1329.1663 1347.6600 1377.1482 1387.6111 1462.3203 1463.9883 1465.1428 1471.8515 1477.3024 1484.1692 1487.3857 2906.5361 2925.3927 2970.9148 2973.9815 2983.5123 2983.6974 2985.9105 2987.7653 3006.5509 3008.4715 3012.2346 3024.1687 3025.8210 3040.9024 3045.5366 3052.0574 3052.6697 3075.6332
redmass: 1.9413 2.3660 2.2824 1.8590 1.7427 2.8647 2.5018 2.7203 3.3324 3.4158 3.4137 2.5053 4.8876 1.3267 1.2676 3.1877 1.9178 2.7847 1.6988 2.6380 2.9143 2.9125 1.4668 1.8194 2.0271 2.0576 2.5985 2.4419 1.5090 2.1287 1.8192 1.4616 2.3092 1.8465 1.0781 1.2919 1.4170 1.4998 1.4072 1.3159 1.1863 1.1826 1.3147 1.5765 1.3987 1.5107 1.5377 1.3737 1.3359 1.5738 1.4145 1.5365 1.5276 1.5401 1.2616 1.3112 1.0790 1.0860 1.0765 1.0883 1.0864 1.1069 1.0917 1.0791 1.0847 1.0598 1.0586 1.0648 1.0606 1.0612 1.0620 1.0842 1.0662 1.0866 1.1022 1.0975 1.1022 1.1041 1.1034 1.1028 1.1052
irintensity: 0.0635 0.0005 0.0512 0.0092 0.0720 0.2357 0.0771 0.5142 0.0353 0.4419 0.2039 1.7421 0.0487 4.6161 0.4686 0.4933 0.5617 2.0132 4.8775 1.9844 2.7621 2.2966 0.6377 0.0187 0.1898 4.5900 0.2342 0.9135 0.1413 0.4786 0.0047 0.4727 0.0469 0.5839 0.1084 0.3824 0.0047 2.1022 4.4180 0.8081 0.9870 0.0262 0.8639 2.3897 5.6120 2.4280 0.3974 0.9649 0.0356 0.0224 2.1051 1.2745 1.0968 0.0914 0.2179 1.5108 1.2947 6.4517 0.0437 2.8927 26.8379 7.4048 4.3364 1.4464 47.4789 22.9665 16.0575 22.5206 3.1553 54.0841 119.7888 166.7140 71.5916 0.1253 13.7556 15.2634 9.4803 52.8953 131.1978 3.9065 99.5947
temp: 298.150 k
press: 1.00000 atm
elementType: 6 6 6 6 6 6 6 6 6 6 6 1 1 1 1 1 1 1 1 1 1 1 1 1 1 1 1 1 1
symmnumber: 1
zpe: 697695.8 jmol-1
zpe.correction: 0.265738 hartree
zpe.thermalcorrener: 0.274833 hartree
zpe.thermalcorrenthalpy: 0.275777 hartree
zpe.thermalcorrgfe: 0.232241 hartree
zpe.sumelectzpe: -429.079259 hartree
zpe.sumelectthermal: -429.070164 hartree
zpe.sumelectthermalent: -429.069219 hartree
zpe.sumelectthermalfe: -429.112756 hartree
dipole: -0.0933 0.0000 0.0000
dipole: 0.0933
quadrupole: -69.1003 -69.7726 -68.3220
quadrupole: 0.0000 0.0000 -0.2943
quadrupole: -0.0354 -0.7077 0.7430 0.0000 0.0000 -0.2943
hfenergy: -429.3449969 hartree
pointgroup: C01 [X(C11H18)]
dipole: -0.0366935 -0.0000016 -0.0000178 debye
polarizability: 119.0326292|-0.000033|103.836504|0.0004096|0.5635552|98.4610432 unknown
InChI: InChI=1S/C11H18/c1-2-10-8-4-6-9(7-5-8)11(10)3-1/h8-11H,1-7H2
charge 0 multiplicity 1
29 atoms
C  0.583534 0.681593 -0.369787
C  0.58349 -0.681596 0.369888
C  -0.830751 1.306385 -0.22542
C  -0.830785 -1.306382 0.225343
C  -1.701626 0.558812 -1.2868
C  -1.437444 0.986892 1.172839
C  -1.4373 -0.986888 -1.172994
C  -1.701797 -0.558813 1.286606
C  1.93402 1.269301 0.087099
C  1.933996 -1.269361 -0.086851
C  2.878426 -0.000015 -0.00004
H  0.715924 0.464766 -1.454728
H  0.715745 -0.464766 1.454841
H  -0.834383 2.397099 -0.41447
H  -0.834437 -2.397097 0.414387
H  -1.456334 0.916254 -2.305444
H  -2.772247 0.782568 -1.112695
H  -2.38306 1.546691 1.30615
H  -0.752441 1.327805 1.972822
H  -2.382901 -1.546687 -1.306426
H  -0.752197 -1.327812 -1.97289
H  -1.456647 -0.916251 2.305285
H  -2.772396 -0.782555 1.112352
H  1.878287 1.646782 1.126436
H  2.29507 2.095557 -0.551611
H  1.878301 -1.647131 -1.126083
H  2.295028 -2.095446 0.552093
H  3.535597 0.061717 -0.886436
H  3.53603 -0.061722 0.886034
