program: Gaussian 09
title: 000142231
version: EM64L-G09RevD.01
frameworkgroup: C1[X(C6H10S)]
method: RPBEPBE
basis: SDD
operation: Freq
keyword: #pfreq=noraman
keyword: PBEPBE/SDD
title: #p freq=noraman PBEPBE/SDD
converged: NO YES NO NO
title: Mulliken charges:
elementType: S C C C C C C H H H H H H H H H H
charge: 0.205822 -0.089453 -0.089511 -0.719288 -0.719258 -0.416456 -0.416585 0.224969 0.224973 0.226400 0.226400 0.219373 0.226390 0.226391 0.219346 0.225277 0.225211
chargesum: 0.00000
title: Mulliken charges with hydrogens summed into heavy atoms:
elementType: S C C C C C C
charge: 0.205822 0.135515 0.135462 -0.047115 -0.047131 -0.191180 -0.191374
polarizability: 1.60548669e+02 -4.48687793e-04 6.80057415e+01 2.01240572e-03 3.59823753e-05 4.35250970e+01
1716.lowfreq: -60.7301 -20.5095 -15.1727 -11.8870 -4.9013 -0.0028 -0.0026 -0.0008 88.4825
frequency: -60.7113 -20.3179 88.4825 175.4349 181.9575 216.4901 227.2024 233.2736 317.9273 370.5713 440.1732 723.1542 738.2227 747.5688 780.8945 928.7884 939.5292 953.1268 958.1239 1038.1962 1038.6726 1092.6396 1105.5439 1226.8083 1257.5495 1280.5540 1299.4893 1394.0671 1394.8255 1460.3912 1460.6237 1470.3284 1471.4559 1637.9180 1656.2033 2962.2885 2962.8460 3036.8036 3036.9121 3073.5913 3073.6995 3103.2728 3103.3830 3116.4098 3119.5514
redmass: 1.5339 2.0427 3.6424 1.6106 1.2659 1.8732 2.3723 3.2170 4.6127 3.4426 5.4507 1.5734 1.6532 3.6613 3.8024 1.0629 1.0678 1.7542 1.7448 1.4770 1.4741 2.2649 2.3757 1.2104 1.2081 1.2141 1.2353 1.2235 1.2237 1.0470 1.0473 1.0715 1.0643 5.6865 5.8167 1.0362 1.0361 1.0977 1.0977 1.0970 1.0970 1.0942 1.0941 1.0906 1.0912
irintensity: 0.0000 0.0264 0.1441 5.4435 0.0000 0.6797 0.0000 2.5256 1.1510 0.2631 2.5659 0.0563 0.0000 49.6569 2.2425 0.0016 157.6210 106.2459 0.4793 1.1107 0.0001 2.5599 0.6999 26.2331 3.0301 0.7598 0.8211 0.0205 13.1045 0.0026 28.2681 2.5441 24.5511 72.7708 2.2699 96.2142 13.5650 2.1275 56.2266 17.9635 17.4323 12.4307 30.1441 33.5460 5.1652
temp: 298.150 k
press: 1.00000 atm
elementType: 16 6 6 6 6 6 6 1 1 1 1 1 1 1 1 1 1
symmnumber: 1
zpe: 364232.7 jmol-1
zpe.correction: 0.138729 hartree
zpe.thermalcorrener: 0.146855 hartree
zpe.thermalcorrenthalpy: 0.147799 hartree
zpe.thermalcorrgfe: 0.105840 hartree
zpe.sumelectzpe: -632.093704 hartree
zpe.sumelectthermal: -632.085579 hartree
zpe.sumelectthermalent: -632.084634 hartree
zpe.sumelectthermalfe: -632.126593 hartree
dipole: -0.0014 -1.4715 0.0000
dipole: 1.4715
quadrupole: -40.6196 -48.8791 -55.3914
quadrupole: -0.0004 0.0000 0.0001
quadrupole: 7.6771 -0.5824 -7.0947 -0.0004 0.0000 0.0001
hfenergy: -632.2324332 hartree
pointgroup: C01 [X(C6H10S1)]
dipole: 0.0006999 0.5789209 0.0000045 debye
dipolederiv: -0.9280587 0.0002121 0.0000327 0.0002461 -0.0812434 -0.0000006 0.0000166 0.0000018 0.0106484 -0.2538111 -0.0341966 -0.0000047 0.0096564 0.1281466 0.0001027 0.0000044 0.0001195 -0.2417664 -0.2539265 0.0344559 -0.0000079 -0.0094816 0.1282526 -0.000111 0.0000057 -0.0001306 -0.2418462 -0.092407 -0.0806785 -0.0000191 0.0613023 0.0351819 -0.0000236 0.0000071 -0.0000315 0.1096019 -0.0922934 0.0807079 -0.0000173 -0.0612112 0.0351414 0.0000265 0.0000037 0.0000343 0.1096221 0.8685218 0.2172567 -0.0000377 0.5302654 0.0885556 0.0001255 -0.0000954 0.0001088 -0.247181 0.8682071 -0.2175959 -0.0000626 -0.5306423 0.0888767 -0.0001325 -0.0001078 -0.0001132 -0.2472635 0.0645476 -0.0096986 0.0000102 -0.006978 -0.1225884 -0.0000963 0.0000165 -0.0000801 0.1769871 0.064533 0.0095283 0.0000139 0.0068059 -0.1226728 0.0001049 0.0000211 0.0000857 0.1770067 -0.0846509 -0.0158982 -0.1174186 -0.0670096 0.0798676 0.0449473 -0.1731041 0.0176992 -0.0547083 -0.0846188 -0.0159674 0.1174107 -0.0671151 0.0799095 -0.044859 0.1730685 -0.0176133 -0.0547788 0.0583429 0.1134951 0.0000374 0.0050576 -0.1371866 -0.0000779 0.0000061 -0.0000804 0.1097875 -0.0846375 0.0160128 -0.1174731 0.067148 0.0798146 -0.0448514 -0.1731595 -0.0175612 -0.0547209 -0.0845913 0.0160867 0.117465 0.0672607 0.0798599 0.0447548 0.1731229 0.0174689 -0.0548052 0.0582339 -0.1136716 0.000041 -0.0052116 -0.1371252 0.0000837 0.0000078 0.0000878 0.1097785 -0.0117303 0.0043724 0.0000118 -0.0412285 -0.1113313 -0.0000985 0.0000863 -0.0000693 0.1968301 -0.0116608 -0.0044212 0.0000183 0.0411355 -0.1114587 0.0001055 0.0000999 0.0000739 0.1968077 unknown
polarizability: 160.548663|-0.024407|68.0057479|-0.0020124|-0.0000355|43.525097 unknown
InChI: InChI=1S/C6H10S/c1-3-5-7-6-4-2/h3-6H,1-2H3
charge 0 multiplicity 1
17 atoms
S  -0.000079 -1.061271 -0.000038
C  2.699822 -0.285644 -0.000084
C  -2.699571 -0.284371 0.000073
C  3.867716 0.677058 0.000156
C  -3.866674 0.679255 -0.000165
C  1.401386 0.106673 0.000119
C  -1.400819 0.107009 -0.000172
H  2.944336 -1.357918 -0.000422
H  -2.944961 -1.356454 0.000444
H  4.509701 0.52431 0.88986
H  4.509605 0.524858 -0.889709
H  3.528482 1.728285 0.000503
H  -4.508812 0.527031 -0.889852
H  -4.508683 0.527621 0.889713
H  -3.526613 1.730226 -0.00054
H  1.119379 1.167892 0.000476
H  -1.118715 1.168241 -0.000562
