program: Gaussian 09
title: 000142215
version: EM64L-G09RevD.01
frameworkgroup: C1[X(C8H8)]
method: RPBEPBE
basis: SDD
operation: Freq
keyword: #p
keyword: freq=noraman
keyword: PBEPBE/SDD
title: #p freq=noraman PBEPBE/SDD
converged: YES YES NO NO
title: Mulliken charges:
elementType: C C C C C C C C H H H H H H H H
charge: -0.441575 -0.441574 0.533930 -0.200791 -0.200792 -0.200792 -0.200789 -0.795172 0.256514 0.256515 0.244643 0.244644 0.244644 0.244642 0.227978 0.227976
chargesum: 0.00000
title: Mulliken charges with hydrogens summed into heavy atoms:
elementType: C C C C C C C C
charge: -0.185061 -0.185060 0.533930 0.043852 0.043852 0.043851 0.043853 -0.339218
polarizability: 8.26955809e+01 -5.85460147e-05 6.35237757e+01 3.56868967e-04 1.36644380e-03 7.72961566e+01
1716.lowfreq: -30.4501 -13.0560 -0.0007 0.0001 0.0006 4.9626 176.3419 317.0884 396.8271
frequency: 176.3303 317.0824 396.8271 435.4498 524.6424 618.5341 633.6173 663.9105 713.0470 733.6420 739.1661 793.6635 831.6041 877.0290 900.4211 904.3338 909.9454 922.1434 928.8183 932.8961 933.4338 1049.7133 1101.8578 1153.4745 1181.9508 1182.0622 1194.3119 1217.7555 1246.5946 1291.6710 1418.1901 1546.1342 1587.5868 1707.1067 3097.2300 3105.2114 3109.3282 3171.5717 3173.4739 3199.5588 3204.1128 3208.0464
redmass: 3.3218 2.3106 2.3699 3.1463 2.6933 3.2191 1.4600 1.4719 3.8230 2.2176 2.1124 2.6529 2.6868 2.3168 1.3441 1.3721 3.4059 1.7256 2.0047 2.3042 1.7664 1.0204 1.4033 3.1447 1.3798 1.3532 1.4227 1.3302 1.5750 1.6943 1.1383 5.2879 6.3611 7.0237 1.0627 1.0896 1.0926 1.0870 1.0877 1.1139 1.1102 1.1117
irintensity: 4.1229 0.1337 4.5389 0.0000 0.7442 14.8941 33.1063 0.0000 28.2793 57.3550 0.0001 8.7388 23.2231 3.6543 0.0000 96.4159 3.4990 0.2771 0.0000 2.3867 5.3018 0.3739 0.5769 2.2349 12.4536 1.3274 0.0128 0.0000 0.0000 18.2267 0.9092 5.6888 0.5108 87.6042 2.4113 43.7126 4.6258 0.0000 9.6766 10.9562 24.6336 10.0667
temp: 298.150 k
press: 1.00000 atm
elementType: 6 6 6 6 6 6 6 6 1 1 1 1 1 1 1 1
symmnumber: 1
zpe: 341136.0 jmol-1
zpe.correction: 0.129932 hartree
zpe.thermalcorrener: 0.136031 hartree
zpe.thermalcorrenthalpy: 0.136975 hartree
zpe.thermalcorrgfe: 0.100288 hartree
zpe.sumelectzpe: -308.978567 hartree
zpe.sumelectthermal: -308.972468 hartree
zpe.sumelectthermalent: -308.971524 hartree
zpe.sumelectthermalfe: -309.008211 hartree
dipole: 0.5865 0.0000 0.0000
dipole: 0.5865
quadrupole: -47.9584 -48.1211 -41.3852
quadrupole: 0.0000 -0.0005 0.0004
quadrupole: -2.1368 -2.2995 4.4363 0.0000 -0.0005 0.0004
hfenergy: -309.108499 hartree
pointgroup: C01 [X(C8H8)]
dipole: 0.2307443 -0.0000047 -0.0000161 debye
dipolederiv: -0.032897 -0.0000028 0.1094982 0.000002 -0.1101651 0.0000004 0.071545 -0.0000058 0.1646491 -0.0329246 -0.0000067 -0.1094697 -0.0000064 -0.1101661 0.0000144 -0.0715191 0.0000071 0.1646754 0.7833721 -0.0000346 -0.0000549 -0.0000432 0.0361015 0.0000053 -0.0000524 0.0000029 -0.0154264 -0.1823482 0.148477 -0.0622905 0.1693516 0.0025837 0.0322485 0.0116263 0.1225264 -0.0579288 -0.1823838 -0.1484674 -0.0622983 -0.16934 0.0026107 -0.0322557 0.0116282 -0.1225266 -0.0579104 -0.1823454 0.1484669 0.0623112 0.1693546 0.0025734 -0.0322824 -0.0116225 -0.1225439 -0.0579145 -0.1823692 -0.1484446 0.0623142 -0.1693305 0.0026222 0.03227 -0.0115954 0.1225505 -0.0579364 -0.5099078 0.0000025 0.0000419 0.0000009 -0.453505 0.0000231 0.000041 0.0000218 0.0992207 0.0346091 -0.0000025 -0.0919679 0. 0.0668463 0.0000021 -0.0477749 0.0000019 -0.1248847 0.0346292 0.0000069 0.0919437 0.0000048 0.0668466 -0.000013 0.047752 -0.0000056 -0.1249047 0.101901 -0.1291014 0.0574074 -0.1085101 0.0181371 0.0665778 0.0476542 0.0674606 0.0437166 0.1019292 0.1290987 0.0573989 0.1085022 0.0180973 -0.0665793 0.0476337 -0.0674693 0.0437265 0.1018921 -0.129116 -0.0574131 -0.1085199 0.0181215 -0.0665586 -0.0476495 -0.0674483 0.0437397 0.101908 0.1291045 -0.0574112 0.1085114 0.0181123 0.066568 -0.0476555 0.0674463 0.0437321 0.0224778 0.0000108 0.0485019 0.0000087 0.2105923 -0.0000133 0.0910375 -0.0000143 -0.053285 0.0224575 0.0000086 -0.0485118 0.0000137 0.2105912 -0.0000072 -0.0910487 -0.0000037 -0.0532692 unknown
polarizability: 82.6955808|-0.0008387|63.5237758|-0.0003568|0.0013665|77.2961566 unknown
InChI: InChI=1S/C8H8/c1-6-7-2-3-8(6)5-4-7/h2-5,7-8H,1H2
charge 0 multiplicity 1
16 atoms
C  0.042636 -0.000059 -1.143914
C  0.042798 0.000017 1.143938
C  -1.00731 0.00004 0.000085
C  0.837294 1.254453 -0.681496
C  0.837089 -1.254658 -0.681431
C  0.837322 1.254539 0.681341
C  0.837249 -1.254573 0.681407
C  -2.354451 0.000103 0.000178
H  -0.315311 -0.000052 -2.182079
H  -0.3150 0.000067 2.182154
H  1.31184 1.967761 -1.358401
H  1.311522 -1.96809 -1.358285
H  1.311916 1.967918 1.358138
H  1.311825 -1.967935 1.358236
H  -2.925399 0.000168 0.93495
H  -2.92552 0.000101 -0.934522
