program: Gaussian 09
title: 000142184
version: EM64L-G09RevD.01
frameworkgroup: C1[X(C9H12N2O4)]
method: RPBEPBE
basis: SDD
operation: Freq
keyword: #p
keyword: freq=noraman
keyword: PBEPBE/SDD
title: #p freq=noraman PBEPBE/SDD
converged: YES YES NO NO
title: Mulliken charges:
elementType: O O O O N N C C C C C C C C C H H H H H H H H H H H H
charge: -0.257760 -0.280643 -0.264556 -0.227179 -0.391513 -0.005295 0.253995 0.034377 -0.403383 0.168279 0.203886 -0.218337 -0.217035 -0.670090 -0.674001 0.300335 0.363710 0.234089 0.234090 0.231170 0.231182 0.215592 0.232957 0.232957 0.213478 0.229847 0.229848
chargesum: 0.00000
title: Mulliken charges with hydrogens summed into heavy atoms:
elementType: O O O O N N C C C C C C C C C
charge: -0.257760 -0.280643 -0.264556 -0.227179 -0.027803 -0.005295 0.253995 0.034377 -0.103048 0.168279 0.203886 0.249842 0.245318 0.011416 -0.000829
polarizability: 1.85782514e+02 -6.75970318e-01 1.36870745e+02 2.35045184e-03 -4.32150146e-03 7.07397893e+01
1716.lowfreq: -5.1719 -2.8939 -0.0009 -0.0007 0.0003 0.8068 21.8983 43.0316 48.0559
frequency: 21.8899 42.9240 48.0555 62.7302 69.9328 94.3420 106.5969 112.4505 169.6224 202.6823 236.6739 250.4010 256.0890 287.4895 295.3925 338.8952 345.7482 425.2361 451.0061 555.3263 604.8203 618.9799 730.6466 733.2441 751.1376 768.6114 786.1669 798.5344 799.1460 822.6454 835.5117 892.4816 951.7136 991.1757 1019.3425 1023.7048 1056.7801 1099.8737 1112.9872 1114.2737 1134.8282 1136.1188 1177.3424 1192.2041 1249.3484 1249.9293 1287.9832 1342.4564 1354.7594 1374.3984 1396.2368 1399.2889 1402.5002 1435.5707 1462.7279 1463.6474 1472.7906 1473.7774 1485.5961 1487.0200 1532.9669 1619.3035 1652.4660 2995.6426 2998.6147 3009.4558 3013.0460 3067.8945 3072.8560 3092.2527 3095.5885 3106.9795 3110.6009 3270.9208 3584.6028
redmass: 3.1501 2.4523 4.0225 4.3374 4.5004 3.6450 4.3728 2.7151 2.7017 4.8888 1.3007 1.3597 5.7894 6.6409 5.6535 3.7327 4.5427 5.5939 6.0098 5.5226 5.7694 10.3422 4.1947 1.7095 2.7451 8.2040 6.0276 1.1033 1.1061 3.9340 4.0930 1.4459 6.1706 5.1803 2.2585 2.3393 2.9323 3.9398 2.3003 2.2580 1.4590 1.4673 2.5291 4.1687 1.1356 1.1327 4.4233 1.7464 1.4378 2.0428 4.6021 1.3148 1.2709 4.8465 1.0398 1.0402 1.0644 1.0636 1.0727 1.0747 4.6851 11.1459 12.0161 1.0357 1.0359 1.0581 1.0581 1.1066 1.1068 1.0985 1.0986 1.1026 1.1028 1.1002 1.0825
irintensity: 0.0904 0.2291 0.1366 0.2529 0.0251 2.4426 0.8073 1.1944 7.3012 9.6886 0.0607 3.2844 8.5052 1.3026 0.7310 11.2279 9.7686 3.1914 1.2293 3.2686 0.8429 0.0024 59.1435 62.2366 8.1020 7.2663 5.5340 3.9506 2.2627 2.9366 1.2235 32.9622 47.2106 91.4745 101.5211 10.6569 223.9788 294.8131 9.0780 8.5124 5.7973 5.7422 359.6624 58.7135 0.0102 0.0002 140.1478 89.9538 0.0079 77.3318 10.5828 24.4311 18.1120 54.9840 12.0969 13.0590 3.8250 4.4875 17.2412 5.6111 28.5757 278.0805 207.2016 19.7822 18.1426 20.8228 17.6722 7.7193 6.8154 32.5308 26.6286 44.0887 41.9412 3.4434 128.9116
temp: 298.150 k
press: 1.00000 atm
elementType: 8 8 8 8 7 7 6 6 6 6 6 6 6 6 6 1 1 1 1 1 1 1 1 1 1 1 1
symmnumber: 1
zpe: 544821.1 jmol-1
zpe.correction: 0.207511 hartree
zpe.thermalcorrener: 0.223276 hartree
zpe.thermalcorrenthalpy: 0.224220 hartree
zpe.thermalcorrgfe: 0.161638 hartree
zpe.sumelectzpe: -759.416326 hartree
zpe.sumelectthermal: -759.400562 hartree
zpe.sumelectthermalent: -759.399618 hartree
zpe.sumelectthermalfe: -759.462199 hartree
dipole: -2.4713 4.5976 -0.0002
dipole: 5.2197
quadrupole: -79.0018 -87.9263 -86.4559
quadrupole: 6.6712 0.0022 0.0009
quadrupole: 5.4595 -3.4650 -1.9945 6.6712 0.0022 0.0009
hfenergy: -759.6238379 hartree
pointgroup: C01[X(C9H12N2O4)]
dipole: -0.9700094 -1.8100413 0.0000653 debye
polarizability: 185.7807392|0.7373913|136.8725196|-0.002345|-0.0043244|70.7397893 unknown
InChI: InChI=1S/C9H12N2O4/c1-3-14-8(12)6-5-7(11-10-6)9(13)15-4-2/h5,10H,3-4H2,1-2H3
charge 0 multiplicity 1
27 atoms
O  -2.815553 -0.850836 0.00034
O  2.786752 -0.827326 0.000174
O  -3.412206 1.416498 -0.000112
O  3.548314 1.384828 0.000076
N  -0.633414 2.086861 -0.000068
N  0.729606 2.190376 -0.000005
C  -1.091963 0.772565 0.000179
C  1.156119 0.874091 0.000328
C  0.056105 -0.036785 0.000374
C  -2.537732 0.508272 0.00016
C  2.604274 0.564404 0.000561
C  -4.269107 -1.219564 0.000263
C  4.208713 -1.288591 -0.000271
C  -4.332774 -2.742171 0.000513
C  4.175775 -2.813092 -0.000652
H  0.099404 -1.121049 0.000589
H  -1.215465 2.925601 -0.000258
H  -4.736384 -0.771948 0.895769
H  -4.736214 -0.77225 -0.895483
H  4.708025 -0.87419 0.894253
H  4.707626 -0.873735 -0.894806
H  -5.388294 -3.069418 0.000471
H  -3.840407 -3.158519 -0.894551
H  -3.840572 -3.158218 0.895808
H  5.207675 -3.208944 -0.00098
H  3.657396 -3.196858 0.894612
H  3.657002 -3.196402 -0.895883
