program: Gaussian 09
title: 000142168
version: EM64L-G09RevD.01
frameworkgroup: C1[X(C5H6O2S)]
method: RPBEPBE
basis: SDD
operation: Freq
keyword: #pfreq=noraman
keyword: PBEPBE/SDD
title: #p freq=noraman PBEPBE/SDD
converged: NO YES NO YES
title: Mulliken charges:
elementType: S O O C C C C C H H H H H H
charge: 0.094104 -0.202457 -0.202456 0.231421 0.231424 -0.753665 -0.753667 -0.135015 0.231230 0.256959 0.256967 0.231230 0.256966 0.256960
chargesum: 0.00000
title: Mulliken charges with hydrogens summed into heavy atoms:
elementType: S O O C C C C C
charge: 0.094104 -0.202457 -0.202456 0.231421 0.231424 -0.008509 -0.008511 -0.135015
polarizability: 1.19067995e+02 -4.09655927e-05 7.10837880e+01 -2.06105909e-02 1.77223577e-04 4.08589706e+01
1716.lowfreq: -12.8900 -9.9057 -7.6888 -0.0034 -0.0026 -0.0007 120.9873 128.9510 143.8574
frequency: 120.9864 128.9504 143.8563 207.8824 222.1684 233.8606 305.3474 442.9028 473.6062 575.1165 599.2995 609.2834 727.2271 824.8315 882.6175 911.4455 955.8104 1047.8141 1049.8995 1143.3252 1156.1394 1261.5114 1283.7905 1406.9688 1411.7462 1450.8720 1453.3974 1470.1146 1471.2095 1730.6515 2991.4305 2991.7100 3072.9563 3073.4237 3104.3605 3106.4819
redmass: 2.2166 1.4234 1.0218 4.5533 4.9582 2.4888 4.2553 4.3287 10.2850 5.0779 12.0770 4.8090 5.6525 10.3829 7.5552 3.3699 1.7557 1.4012 1.4654 2.4723 4.0089 10.8852 4.5883 1.3593 1.2320 1.0423 1.0410 1.0443 1.0661 8.4373 1.0371 1.0369 1.0990 1.0987 1.0986 1.0981
irintensity: 1.3188 1.7918 0.0000 0.0000 0.5863 0.0974 1.8292 0.2215 3.4550 0.0000 0.0113 4.9381 6.1066 63.6555 3.4252 25.5305 19.3648 8.3496 0.0000 58.0005 206.8420 429.2539 0.8352 8.1006 23.7256 0.0000 29.6093 12.5246 18.9278 4.7444 18.4029 16.4756 0.0014 19.0811 11.2915 12.9149
temp: 298.150 k
press: 1.00000 atm
elementType: 16 8 8 6 6 6 6 6 1 1 1 1 1 1
symmnumber: 1
zpe: 263435.6 jmol-1
zpe.correction: 0.100337 hartree
zpe.thermalcorrener: 0.108695 hartree
zpe.thermalcorrenthalpy: 0.109639 hartree
zpe.thermalcorrgfe: 0.067011 hartree
zpe.sumelectzpe: -742.009372 hartree
zpe.sumelectthermal: -742.001015 hartree
zpe.sumelectthermalent: -742.000070 hartree
zpe.sumelectthermalfe: -742.042699 hartree
dipole: 6.3153 0.0000 0.0005
dipole: 6.3153
quadrupole: -53.3858 -53.0427 -54.0083
quadrupole: 0.0000 -0.0016 -0.0002
quadrupole: 0.0931 0.4362 -0.5294 0.0000 -0.0016 -0.0002
hfenergy: -742.1097095 hartree
pointgroup: C01 [X(C5H6O2S1)]
dipole: 2.4846118 -0.0000604 0.0003926 debye
dipolederiv: -1.0361871 0.0000203 -0.0001562 0.0000192 -0.1863329 0.0000003 -0.0016909 -0.0000009 -0.1473887 -1.1724856 -0.0048561 -0.00032 -0.6839681 -0.5462172 -0.0003951 0.000947 0.0003776 -0.0746595 -1.1724531 0.0048831 -0.0003329 0.6839986 -0.5462512 0.0003939 0.0009633 -0.0003917 -0.0746595 0.5317056 -0.0025633 0.000179 0.1174288 0.3082865 0.0000136 -0.0002566 -0.0001092 -0.018514 0.531698 0.002555 0.0002088 -0.1174393 0.3082989 -0.0000202 -0.0002495 0.0001186 -0.0185119 -0.0871648 -0.0205525 -0.0000208 -0.0685724 -0.0309782 0.0000512 0.0000067 0.0000295 0.0839528 -0.0871607 0.0205559 -0.0000254 0.0685762 -0.0309831 -0.0000336 0.0000017 -0.0000235 0.0839525 2.2738395 -0.0000408 0.0004903 -0.0000408 0.5820955 0.0000042 0.0002347 0.0000114 -0.0195428 -0.0814699 0.0435697 -0.000021 0.1082806 0.0469696 0.0000057 0.0000023 0.0000011 0.1245655 0.0952859 -0.0249643 0.036662 -0.0435593 0.0120004 -0.0836095 -0.0020753 -0.1194339 -0.0159339 0.0952883 -0.0249672 -0.0366562 -0.0435519 0.0120706 0.0835684 0.0020887 0.1194073 -0.0159457 -0.0814757 -0.0435633 -0.0000423 -0.1082744 0.046977 -0.000027 -0.0000185 -0.0000133 0.1245655 0.0952907 0.0249836 -0.0366458 0.0435621 0.0120719 -0.083564 0.0020999 -0.1194084 -0.0159653 0.0952887 0.0249398 0.0366805 0.0435406 0.0119922 0.083612 -0.0020536 0.1194352 -0.015915 unknown
polarizability: 119.0679814|-0.0011027|71.083788|0.0388727|0.0000924|40.8589845 unknown
InChI: InChI=1S/C5H6O2S/c1-3-4(2)7-5(8)6-3/h1-2H3
charge 0 multiplicity 1
14 atoms
S  -3.038898 0.000095 -0.001078
O  -0.534184 1.133308 0.000028
O  -0.534239 -1.133237 -0.000004
C  0.832803 0.681738 0.000306
C  0.832767 -0.681736 0.000302
C  1.886752 1.733655 0.000235
C  1.886668 -1.7337 0.000265
C  -1.377943 0.000057 0.00101
H  2.888476 1.273364 0.000293
H  1.801411 2.380431 0.891924
H  1.801447 2.380283 -0.891567
H  2.888413 -1.273457 0.000468
H  1.801431 -2.380269 -0.891586
H  1.801196 -2.380532 0.891903
