program: Gaussian 09
title: 000142165
version: EM64L-G09RevD.01
frameworkgroup: C1[X(C12H11NO)]
method: RPBEPBE
basis: SDD
operation: Freq
keyword: #p
keyword: freq=noraman
keyword: PBEPBE/SDD
title: #p freq=noraman PBEPBE/SDD
converged: YES YES NO NO
title: Mulliken charges:
elementType: O N C C C C C C C C C C C C H H H H H H H H H H H
charge: -0.265410 -0.150384 0.257503 0.039039 -0.373357 0.312146 -0.224106 -0.293770 -0.597753 -0.378888 -0.355696 -0.239273 -0.234656 -0.230880 0.278060 0.254280 0.249150 0.253025 0.207696 0.266620 0.267904 0.268476 0.229312 0.230201 0.230763
chargesum: 0.00000
title: Mulliken charges with hydrogens summed into heavy atoms:
elementType: O N C C C C C C C C C C C C
charge: -0.265410 -0.150384 0.257503 0.039039 -0.095297 0.312146 0.030174 -0.044620 0.129588 -0.110984 -0.087220 -0.009961 -0.004456 -0.000117
polarizability: 2.08420449e+02 -6.73031825e+00 1.40680230e+02 3.57867603e+00 -6.29584511e+00 7.31782100e+01
1716.lowfreq: -9.0759 -3.7458 -0.7534 -0.0005 -0.0004 -0.0003 48.9102 60.7858 100.8980
frequency: 48.8141 60.7601 100.8905 130.8833 138.9146 214.3926 222.5170 244.6016 266.3130 378.5963 406.3537 413.5893 447.4831 542.6018 602.4313 613.9667 620.2184 668.7210 693.2720 704.3647 720.7380 744.9235 794.2553 821.8534 861.0961 865.3975 888.7034 901.7473 943.1885 986.2537 989.1920 1001.7995 1015.6863 1028.6818 1067.7436 1082.5039 1091.7562 1120.8172 1154.4764 1173.1354 1188.1573 1224.9011 1249.6991 1315.4092 1335.8414 1366.6781 1382.1551 1419.2348 1424.6568 1432.9588 1452.6865 1461.6509 1476.7619 1487.7004 1509.0732 1533.4062 1587.3314 1608.0154 3011.6938 3114.1099 3117.2003 3126.0304 3136.6061 3149.4412 3158.5056 3168.1116 3209.6715 3223.9987 3241.9921
redmass: 4.7709 3.7449 4.4194 1.3584 2.5567 4.4064 3.4847 4.6149 5.0482 7.0349 2.8963 3.4928 4.0655 5.6140 2.9324 6.2128 4.8605 6.3916 4.4710 2.0646 2.3576 1.2536 2.0935 1.6076 1.2787 5.5129 1.4146 4.0401 1.4335 1.4458 5.0049 1.3285 1.7412 1.9029 1.4523 1.5743 1.3062 1.3207 3.0514 1.0580 1.1423 1.5139 4.6835 1.3572 3.3159 6.3146 8.5415 2.4921 2.2325 2.3733 1.1503 1.8342 2.2752 1.2652 3.3644 7.1580 6.2341 6.0505 1.0334 1.1021 1.1021 1.0849 1.0883 1.0925 1.0959 1.1011 1.0900 1.0970 1.1087
irintensity: 4.7498 0.9508 0.8646 0.7680 1.1330 2.6721 1.3144 6.7611 1.9158 5.9999 0.1885 0.1798 1.9936 2.8684 8.3064 0.1369 6.9814 28.0486 0.7488 46.6059 90.7526 66.2184 16.5982 3.6648 0.9532 29.3793 2.5097 42.6741 3.0702 5.1194 0.1318 0.5197 0.7180 6.2033 41.0145 7.0633 23.8632 1.1372 23.1502 0.0405 6.7980 1.9207 93.2660 0.4913 38.3148 101.6766 4.5944 10.8933 70.0223 46.4304 41.2557 102.9974 1.7631 5.1555 16.4770 197.8658 7.8793 13.6117 40.6354 16.2526 11.3372 0.1288 8.5575 18.8401 20.7953 21.5268 2.1505 3.1235 2.5133
temp: 298.150 k
press: 1.00000 atm
elementType: 8 7 6 6 6 6 6 6 6 6 6 6 6 6 1 1 1 1 1 1 1 1 1 1 1
symmnumber: 1
zpe: 519701.5 jmol-1
zpe.correction: 0.197944 hartree
zpe.thermalcorrener: 0.209823 hartree
zpe.thermalcorrenthalpy: 0.210767 hartree
zpe.thermalcorrgfe: 0.159300 hartree
zpe.sumelectzpe: -592.864253 hartree
zpe.sumelectthermal: -592.852374 hartree
zpe.sumelectthermalent: -592.851430 hartree
zpe.sumelectthermalfe: -592.902897 hartree
dipole: 1.0366 -1.8621 0.5214
dipole: 2.1940
quadrupole: -60.6893 -81.6836 -83.9421
quadrupole: 2.8454 3.0997 -1.2998
quadrupole: 14.7490 -6.2453 -8.5038 2.8454 3.0997 -1.2998
hfenergy: -593.0621971 hartree
pointgroup: C01 [X(C12H11N1O1)]
dipole: 0.5104448 0.64839 0.2532647 debye
dipolederiv: -0.8253694 0.0423635 0.0424457 -0.1048916 -0.7016039 -0.3756132 -0.2111967 -0.343966 -0.6644081 0.2679557 0.0639111 0.0491128 -0.0053781 -0.2584241 -0.2726466 0.1171575 -0.2435109 -0.5481773 -0.9373907 -0.3169681 -0.3998608 -0.3805499 -0.1259544 -0.0292056 -0.5389192 -0.0798141 0.0050501 2.0745203 0.0139771 0.023102 0.1551691 0.6428171 0.4941468 0.2132995 0.4451529 0.5910232 0.3564797 0.0843275 0.0377579 0.3577316 -0.1184061 0.0437024 0.2863523 0.0642634 -0.0910471 -0.4987168 0.1260421 0.1425272 0.1380732 -0.0767562 -0.0820873 0.1752618 -0.0556174 -0.0821076 -0.2720865 0.0418744 0.0711247 -0.2011001 -0.054354 0.2088684 -0.3468766 0.1563264 0.1841296 -0.4588225 0.0106335 0.0387361 0.1170151 -0.1795671 0.0822453 0.295939 0.1037474 -0.1265118 0.2081649 -0.0239515 -0.0777701 -0.045093 0.2293498 0.0986121 -0.1218571 0.104432 0.3813591 -0.0042643 0.0742918 -0.0359189 -0.0962602 -0.0118526 0.0290597 -0.1646869 0.0209606 -0.0768895 0.03697 -0.0855935 -0.0646242 0.0962692 0.0482472 0.019109 0.0556618 0.0714285 -0.1079952 -0.2068367 -0.0309311 -0.0062217 -0.0776265 0.1203407 0.0716052 0.0065958 0.0789336 -0.1318162 0.0161799 0.1622388 -0.0119882 0.1838798 -0.0335692 -0.0132537 -0.0064635 -0.0161641 -0.1550063 0.0705364 -0.035001 -0.0776131 -0.0145318 0.0048435 0.0465708 -0.0642151 0.0414725 -0.1135519 0.0608038 0.0253178 0.0809987 0.0266648 0.1377032 -0.0507954 0.1043878 -0.0381076 0.0668023 -0.01706 -0.002714 0.0520158 0.0233958 0.1735493 -0.051789 0.0777103 -0.0450604 0.0944071 0.0395022 -0.0524485 -0.0562402 -0.0739788 0.1362971 -0.095991 -0.0612999 -0.0934476 0.0485309 0.0477456 0.0487517 -0.1088391 0.067027 0.0410245 0.031151 -0.0271357 0.0145929 -0.0262689 -0.1499002 -0.0006408 0.1267767 -0.0746645 0.1007294 0.0075452 0.0148801 -0.0263864 0.0594091 0.1188014 -0.0528152 -0.0069451 0.0142862 -0.0754107 -0.0321932 0.029324 0.0180535 0.0354905 0.0280509 -0.1025349 0.023343 -0.1123647 0.0409437 0.0051027 0.0311882 -0.0152825 0.1096976 0.1302327 0.0360642 0.0218677 0.0081455 -0.0147692 -0.0305087 -0.0199365 -0.058507 0.1401377 0.0713874 0.0163165 0.0235137 0.0504612 -0.1050539 -0.0643067 0.0428776 -0.0609176 0.1341142 -0.0629496 -0.1000075 0.032606 -0.1159105 0.0058682 -0.0047865 0.0314382 -0.004904 0.1474578 -0.093934 0.0574961 0.0800934 0.064231 0.0740077 -0.0345419 0.0805134 -0.0376777 0.1261707 unknown
polarizability: 207.1317178|5.9856868|116.1027727|-15.0244178|32.1265179|99.0443985 unknown
InChI: InChI=1S/C12H11NO/c1-13-9-5-8-11(13)12(14)10-6-3-2-4-7-10/h2-9H,1H3
charge 0 multiplicity 1
25 atoms
O  -0.035274 -1.498683 -1.576297
N  2.483855 -0.184987 -0.909192
C  1.252217 0.034442 -0.249673
C  -0.01164 -0.543635 -0.720809
C  1.541809 0.767214 0.933904
C  -1.310116 -0.014894 -0.169351
C  3.497266 0.4027 -0.172492
C  2.945189 0.993486 0.982055
C  2.691259 -0.894882 -2.185308
C  -1.499738 1.343936 0.199549
C  -2.410672 -0.910803 -0.097021
C  -2.762109 1.790251 0.64973
C  -3.665675 -0.46761 0.365622
C  -3.844801 0.885633 0.74324
H  0.809824 1.051122 1.687145
H  4.53059 0.367117 -0.514331
H  3.501991 1.514615 1.758468
H  2.010673 -0.506135 -2.958948
H  3.736163 -0.741313 -2.502892
H  2.482849 -1.969588 -2.07078
H  -0.674406 2.056111 0.099237
H  -2.257198 -1.946765 -0.416887
H  -2.902694 2.843124 0.918588
H  -4.504454 -1.169624 0.428748
H  -4.822108 1.233069 1.096992
