program: Gaussian 09
title: 000142132
version: EM64L-G09RevD.01
frameworkgroup: C1[X(C9H16)]
method: RPBEPBE
basis: SDD
operation: Freq
keyword: #p
keyword: freq=noraman
keyword: PBEPBE/SDD
title: #p freq=noraman PBEPBE/SDD
converged: YES YES NO NO
title: Mulliken charges:
elementType: C C C C C C C C C H H H H H H H H H H H H H H H H
charge: -0.027785 -0.389507 -0.495381 -0.712877 -0.712592 -0.027887 -0.454044 -0.016499 -0.660821 0.203618 0.210680 0.211034 0.237892 0.237847 0.209995 0.212653 0.215141 0.212683 0.215225 0.209656 0.229811 0.230361 0.212298 0.224435 0.224063
chargesum: 0.00000
title: Mulliken charges with hydrogens summed into heavy atoms:
elementType: C C C C C C C C C
charge: 0.175833 0.032207 -0.019642 -0.075088 -0.075028 -0.027887 0.006129 -0.016499 -0.000025
polarizability: 1.36853108e+02 1.85154274e-01 7.98769839e+01 -2.68252595e+00 2.16998787e-01 7.70836925e+01
1716.lowfreq: -29.8888 -26.9721 -10.2124 -7.3939 -0.0006 -0.0005 0.0006 34.0409 60.9334
frequency: -29.6159 33.4804 60.6250 92.4639 139.7009 178.2921 215.2254 215.4965 240.3708 259.2793 329.8468 355.9584 363.3366 413.6265 490.0150 532.3573 733.3394 751.5881 776.9014 789.7478 908.9857 943.4162 945.6436 958.7613 974.6450 992.5972 1063.0365 1081.0224 1113.8574 1118.2846 1164.4303 1191.5806 1199.6378 1252.2643 1258.5349 1280.4513 1316.8894 1321.1104 1331.8540 1351.9331 1375.4164 1387.2337 1392.3109 1454.8085 1463.8326 1465.1347 1470.2684 1472.4114 1476.1897 1484.5856 1485.2922 1489.0230 2275.9674 2956.6198 2968.6353 2969.1240 2972.2926 2973.9863 2985.7141 2988.0390 3013.3650 3016.2637 3045.9286 3060.8415 3066.4999 3068.1661 3070.0424 3086.4036 3096.2911
redmass: 2.1474 3.1007 3.1227 1.9057 2.7967 1.8360 1.1849 2.2886 1.0386 1.8141 2.9666 2.2073 2.2146 4.2427 3.3201 3.2217 3.0269 1.1976 1.1720 3.1927 1.1988 2.2114 1.3653 2.1793 1.8744 2.0129 1.9870 1.4595 1.6037 1.7894 2.4989 1.9059 1.3153 1.1470 1.5154 1.1038 1.5051 1.5873 1.4659 1.3720 1.2106 1.1957 1.2159 1.0712 1.0742 1.0457 1.0914 1.0420 1.0539 1.0560 1.0507 1.0540 11.6874 1.0796 1.0354 1.0499 1.0586 1.0444 1.0624 1.0354 1.0996 1.1006 1.1038 1.0996 1.1000 1.0985 1.0991 1.1001 1.1013
irintensity: 0.0175 0.1129 1.2654 0.1277 3.0752 4.0807 0.0597 0.2892 0.0991 5.1103 4.0519 0.2963 0.6128 4.2655 4.6704 1.5384 3.6257 4.4085 6.6768 1.6707 1.9320 0.1597 0.4752 0.1472 0.0800 9.0611 7.3443 0.4688 1.1465 0.2777 0.3772 5.3386 2.7302 0.6551 7.4786 0.0139 13.6292 12.5031 2.2473 1.2538 22.0702 9.0538 18.0287 4.6107 5.5303 1.6433 3.9815 12.5712 2.6839 9.1796 16.7871 18.7216 1.2138 17.1251 39.5069 2.5669 40.8719 44.0392 40.6408 45.8853 2.4564 12.9639 44.6653 8.2216 27.7792 103.3468 74.5848 49.3875 40.1182
temp: 298.150 k
press: 1.00000 atm
elementType: 6 6 6 6 6 6 6 6 6 1 1 1 1 1 1 1 1 1 1 1 1 1 1 1 1
symmnumber: 1
zpe: 584802.1 jmol-1
zpe.correction: 0.222739 hartree
zpe.thermalcorrener: 0.234057 hartree
zpe.thermalcorrenthalpy: 0.235001 hartree
zpe.thermalcorrgfe: 0.185148 hartree
zpe.sumelectzpe: -351.766980 hartree
zpe.sumelectthermal: -351.755662 hartree
zpe.sumelectthermalent: -351.754718 hartree
zpe.sumelectthermalfe: -351.804571 hartree
dipole: 0.2032 0.1807 0.2605
dipole: 0.3766
quadrupole: -50.6629 -58.2214 -57.8123
quadrupole: 0.3081 -0.2962 -0.0754
quadrupole: 4.9026 -2.6558 -2.2468 0.3081 -0.2962 -0.0754
hfenergy: -351.9897189 hartree
pointgroup: C01 [X(C9H16)]
dipole: 0.0829094 -0.0812638 -0.0920372 debye
dipolederiv: 0.1681413 -0.0033272 -0.0059231 0.0357759 0.1514119 -0.012974 0.057757 -0.0138845 0.1385714 -0.0031139 -0.0057031 -0.0118781 -0.0887752 0.1069054 0.0028547 -0.1589339 0.0051097 0.1053749 0.0865554 0.0231031 0.0281496 0.0467466 0.1715229 -0.0563248 0.0738013 -0.0507493 0.1207807 -0.0182182 0.0106803 -0.0488962 -0.0124411 0.0178728 0.0842916 -0.066014 0.0743672 -0.0182802 -0.0260424 -0.0567041 -0.0138934 -0.0604182 -0.0640646 0.027777 -0.0419556 0.0394502 0.0711501 0.0217805 -0.0259938 0.007237 0.0550253 -0.1689888 -0.0076716 0.0883773 -0.0153483 -0.1640844 0.2544527 -0.0136116 -0.0033212 -0.0388405 0.13238 -0.0242497 -0.0059063 -0.0315198 0.1906055 -0.1241825 0.0243664 0.0427451 -0.0556611 -0.2080397 -0.0235354 -0.0208535 -0.0144261 -0.1788222 -0.0084419 -0.0293331 -0.0147308 0.0560527 0.0198997 -0.0209705 0.0075344 -0.0261974 0.068687 -0.055841 0.0434216 0.0649364 0.0489577 -0.0388898 -0.099126 0.0703185 -0.0987999 -0.1262955 0.0301505 0.0420214 -0.0499651 0.0561699 0.0259602 0.0976939 -0.0420501 0.0661308 -0.1336624 0.0151244 -0.0788983 0.0096864 -0.0780806 -0.1543184 -0.033528 0.0299534 -0.0044618 0.0616781 -0.0195278 -0.079977 -0.0262509 -0.0859339 -0.0970842 -0.0290417 -0.0067611 -0.0125739 0.0814547 -0.0065071 0.0151512 -0.0656268 0.0379739 0.0564258 0.0775502 -0.0703539 0.0569871 -0.0878579 0.0925675 0.039856 0.0737147 0.0453221 0.0026454 -0.1242641 0.0593763 -0.0739178 -0.0970788 -0.2258506 0.0565571 -0.0338233 0.0285652 0.0901739 0.0109571 0.0075455 0.0041039 0.0740804 0.0666563 -0.1260049 0.0130035 -0.0871461 -0.1497323 0.0471529 0.0004925 0.0210935 0.061676 -0.2313586 -0.0297284 0.0186985 0.0215001 0.0741432 -0.0069783 0.0116901 -0.0019735 0.0955222 0.083944 0.0534071 -0.0907688 0.0256221 -0.0134265 0.1014324 -0.0584341 0.1265016 -0.0915122 0.0922756 0.048132 0.0707515 0.0293154 -0.0064351 -0.0797805 0.0654817 -0.1283276 -0.0872846 -0.0412693 0.0306913 -0.0513565 0.0422537 -0.0658482 0.0867814 -0.098564 0.111318 0.0184371 -0.0815575 0.0152439 0.0724382 -0.0122166 0.0727784 -0.0514511 0.1032189 -0.0713714 -0.0814933 -0.2525534 -0.0297798 -0.0507553 -0.0271413 0.0625057 -0.0162778 -0.053109 -0.019374 0.0929575 0.0771899 0.0221238 0.1129411 0.001625 0.0579355 -0.0373595 0.0705436 -0.0637623 -0.109146 0.105626 0.054306 -0.0471125 0.0157489 -0.0757332 0.087042 -0.0231549 0.1216255 -0.0054582 unknown
polarizability: 136.7319071|1.1986171|79.9135789|3.6011568|-0.0507089|77.168298 unknown
InChI: InChI=1S/C9H16/c1-4-5-6-7-8-9(2)3/h9H,4,7-8H2,1-3H3
charge 0 multiplicity 1
25 atoms
C  2.759971 -0.340883 -0.460575
C  1.209885 -0.321705 -0.583348
C  0.473254 0.435718 0.560522
C  3.243596 -1.083749 0.80911
C  3.376452 1.077366 -0.542466
C  -0.992458 0.429858 0.392947
C  -3.683351 0.3890 0.051044
C  -2.218712 0.418682 0.23856
C  -4.195733 -0.958598 -0.524907
H  3.129037 -0.9126 -1.338875
H  0.926445 0.144341 -1.54759
H  0.832758 -1.362884 -0.610997
H  0.831004 1.483446 0.602308
H  0.730267 -0.022695 1.535785
H  2.973839 -0.531316 1.728839
H  4.343863 -1.195687 0.803469
H  2.798872 -2.094514 0.876801
H  4.480197 1.023006 -0.586099
H  3.025673 1.61558 -1.443039
H  3.112172 1.686635 0.342385
H  -3.984263 1.214395 -0.624551
H  -4.181955 0.586313 1.0210
H  -5.293674 -0.932965 -0.649979
H  -3.737049 -1.162427 -1.508091
H  -3.940591 -1.793919 0.15015
