program: Gaussian 09
title: 000142131
version: EM64L-G09RevD.01
frameworkgroup: C1[X(C9H16)]
method: RPBEPBE
basis: SDD
operation: Freq
keyword: #p
keyword: freq=noraman
keyword: PBEPBE/SDD
title: #p freq=noraman PBEPBE/SDD
converged: YES YES NO NO
title: Mulliken charges:
elementType: C C C C C C C C C H H H H H H H H H H H H H H H H
charge: -0.016420 -0.455693 -0.698036 -0.720694 -0.263264 -0.418451 0.078602 -0.267503 -0.670415 0.198356 0.201425 0.213618 0.225315 0.209502 0.206599 0.220809 0.211305 0.214511 0.231818 0.206444 0.219398 0.221250 0.210899 0.216276 0.224347
chargesum: 0.00000
title: Mulliken charges with hydrogens summed into heavy atoms:
elementType: C C C C C C C C C
charge: 0.181936 -0.040649 -0.056620 -0.074069 -0.031446 0.007391 0.078602 -0.046253 -0.018893
polarizability: 1.47144698e+02 -1.07165624e+01 8.31794626e+01 7.36497526e+00 -2.22718672e+00 7.90462606e+01
1716.lowfreq: -17.3087 -10.6549 -0.0005 0.0006 0.0007 5.2225 25.1362 32.6233 70.7328
frequency: 24.0861 32.1585 70.2515 92.3869 141.3175 188.1729 212.7661 227.7519 245.5476 266.4205 343.3393 358.5350 394.5373 501.9023 528.0107 559.4608 714.8157 775.8785 791.8080 847.7465 882.8736 894.9394 915.0071 944.5011 958.7110 974.5637 1022.3466 1062.7351 1084.5905 1103.4027 1122.0538 1154.4544 1188.6512 1220.2874 1241.2200 1263.5048 1280.2622 1311.6236 1329.6822 1338.9456 1374.4636 1383.8171 1392.2488 1419.5685 1457.0525 1463.7635 1464.4157 1472.0369 1474.3564 1481.9113 1483.3365 1488.1020 2003.1980 2953.1082 2967.9808 2969.0272 2971.3543 2974.8912 2977.4626 3037.7428 3042.4437 3060.9212 3063.5844 3064.1926 3068.7384 3070.7745 3075.0651 3075.8979 3083.6727
redmass: 2.8515 2.7992 2.3563 2.4167 2.7430 1.3468 1.4519 1.0905 1.5217 2.2984 2.2360 2.0911 2.4942 3.6184 2.4477 3.1195 1.5615 1.5658 2.0186 1.8170 1.6016 1.2200 1.2705 1.6683 1.7404 2.1295 2.2250 1.8236 1.4817 1.6542 1.9684 1.6100 1.9708 1.2571 1.2434 1.3246 1.3339 1.3730 1.4923 1.3563 1.2266 1.2165 1.2184 2.5403 1.0919 1.0447 1.0705 1.0543 1.0439 1.0484 1.0631 1.0544 10.6545 1.0723 1.0607 1.0389 1.0628 1.0452 1.0369 1.0966 1.0941 1.0909 1.0997 1.0980 1.0984 1.0927 1.0972 1.0986 1.1010
irintensity: 0.0552 0.1786 0.0331 1.0689 0.8194 0.2848 0.2040 0.5685 0.9419 0.7514 0.3147 0.3103 1.0271 6.5703 20.3413 0.5955 13.5346 10.7179 11.6248 4.1327 5.1733 30.7963 6.8970 2.8126 1.0866 1.0664 0.9137 8.9057 10.1090 1.6341 2.3779 2.2696 6.5473 1.5918 0.2163 1.7940 19.9437 0.1470 1.1847 8.6366 22.7763 10.5383 17.7668 0.7856 7.1489 2.2831 7.1681 4.0892 10.7280 19.8064 10.3983 14.2509 27.0712 10.8332 62.4167 54.9913 44.7207 17.5437 38.5793 12.9326 0.6441 4.4170 41.5772 6.7311 55.1071 28.6052 91.1653 61.1179 57.4103
temp: 298.150 k
press: 1.00000 atm
elementType: 6 6 6 6 6 6 6 6 6 1 1 1 1 1 1 1 1 1 1 1 1 1 1 1 1
symmnumber: 1
zpe: 582739.1 jmol-1
zpe.correction: 0.221954 hartree
zpe.thermalcorrener: 0.233959 hartree
zpe.thermalcorrenthalpy: 0.234903 hartree
zpe.thermalcorrgfe: 0.182625 hartree
zpe.sumelectzpe: -351.771277 hartree
zpe.sumelectthermal: -351.759272 hartree
zpe.sumelectthermalent: -351.758328 hartree
zpe.sumelectthermalfe: -351.810606 hartree
dipole: -0.0108 0.0668 0.3610
dipole: 0.3673
quadrupole: -53.3589 -57.9619 -57.7182
quadrupole: -0.7924 1.1403 -0.4435
quadrupole: 2.9874 -1.6156 -1.3719 -0.7924 1.1403 -0.4435
hfenergy: -351.9932303 hartree
pointgroup: C01 [X(C9H16)]
dipole: -0.0057138 -0.0687918 0.1269623 debye
dipolederiv: 0.2324051 0.0052829 -0.0121856 -0.0312621 0.1573273 0.0058809 0.1091605 0.0021724 0.1278372 0.0197574 0.0032936 -0.0068121 0.1317429 0.0668737 -0.0036909 -0.1119431 0.0355025 0.129061 0.0003419 0.0210849 0.0076601 0.0389104 -0.0103023 -0.0837697 -0.0139262 -0.0664132 -0.029652 -0.0166788 0.0740155 -0.0492102 0.0460362 -0.0342833 0.0212032 -0.0742082 0.0085719 0.0468805 -0.2209513 -0.0289968 -0.086643 0.0487498 0.1049091 -0.1543162 -0.1043742 -0.2003774 -0.1326775 0.120923 0.0205807 -0.0354384 0.1020133 0.1062427 -0.0520014 0.1005306 -0.0459913 0.1169664 0.4066391 -0.151004 -0.1595356 -0.2826466 -0.1515324 0.0381667 -0.2142098 0.0712214 -0.1650292 -0.1092536 0.0127305 0.0928115 0.1190912 -0.1732716 0.1899894 0.1190807 0.1787669 0.078346 -0.0269528 0.0504357 -0.0254613 -0.0471202 0.0118813 0.0266652 -0.0924387 0.0399436 0.0778326 -0.1147084 -0.0655089 0.0978666 -0.092614 -0.0408761 0.0921804 0.0728715 0.0856442 -0.0873055 -0.0323015 0.0088243 0.0873403 -0.04333 -0.0067167 -0.1231239 0.1141476 -0.0990211 -0.1151121 -0.0205689 0.0851914 -0.0591327 0.0543765 -0.0849006 0.0974549 -0.0178946 0.0505986 0.051762 0.0387426 -0.0392286 0.1096132 -0.0511488 0.0157528 0.0965344 0.1146701 0.0477266 -0.0227284 0.0230569 0.1436117 -0.0214652 0.1131813 -0.1006468 0.0316563 -0.0224795 0.0686975 0.0468541 -0.1351394 -0.0961555 -0.1235791 -0.0718156 0.0614349 -0.0505794 -0.1143478 -0.0604709 0.013588 0.0524668 -0.0790212 0.1055592 -0.0377234 0.0054757 0.0823633 0.0971179 0.1030709 -0.0389764 0.0965881 0.0361186 0.019833 0.058245 -0.0491638 -0.1133035 0.0664742 -0.1440061 -0.0779405 -0.1727106 -0.0341118 -0.0955552 -0.0923091 0.0590984 -0.0282833 -0.1205622 -0.0131417 0.0494532 0.0211037 0.0912599 0.019022 0.0808445 -0.039589 0.0772226 0.0609446 0.085128 0.1059653 -0.1403893 -0.087266 0.0510797 -0.1067018 -0.0267008 0.0838101 0.0216787 0.1113299 0.0094892 0.0508325 0.0683395 0.0526039 0.0385223 -0.0007481 -0.0838869 -0.0093909 -0.1031833 -0.0794344 -0.012486 0.0270764 0.031026 0.0258483 0.0993779 -0.129204 0.0185366 -0.111198 -0.0385773 0.0893224 0.0389078 0.0345649 0.0507316 0.0009062 -0.0809936 0.0888912 -0.1273162 -0.102649 -0.1829042 -0.0039417 -0.1288786 -0.0058334 0.0578743 -0.0284368 -0.1605651 -0.0117063 0.0228488 0.0328653 -0.1015191 0.094917 -0.0457883 -0.0284228 0.0884619 0.0722362 0.0944512 0.0131981 unknown
polarizability: 148.058459|-8.9587993|81.6938956|-5.4501343|2.5127543|79.6180668 unknown
InChI: InChI=1S/C9H16/c1-4-5-6-7-8-9(2)3/h5,7,9H,4,8H2,1-3H3
charge 0 multiplicity 1
25 atoms
C  -2.685859 -0.575386 0.173553
C  -1.386468 -0.140173 0.922964
C  -2.367736 -1.496336 -1.026701
C  -3.540013 0.637935 -0.266106
C  -0.436597 0.717136 0.092547
C  3.292094 0.310844 0.244244
C  0.801951 0.369258 -0.256268
C  2.045453 0.022496 -0.586734
C  4.066168 -0.9815 0.605727
H  -3.282435 -1.159446 0.906776
H  -1.682459 0.434478 1.825997
H  -0.849723 -1.042245 1.271862
H  -1.75059 -0.963601 -1.773542
H  -1.806254 -2.39371 -0.705638
H  -3.296398 -1.832922 -1.52435
H  -3.026835 1.22305 -1.051842
H  -3.749402 1.314898 0.583859
H  -4.509221 0.305146 -0.681853
H  -0.818457 1.698147 -0.231626
H  3.961296 0.981619 -0.333117
H  3.007185 0.854283 1.163136
H  2.213238 -0.524779 -1.529049
H  4.36532 -1.532608 -0.305454
H  4.983538 -0.746036 1.176286
H  3.441005 -1.656049 1.217828
