program: Gaussian 09
title: 000142128
version: EM64L-G09RevD.01
frameworkgroup: C1[X(C16H13N)]
method: RPBEPBE
basis: SDD
operation: Freq
keyword: #pfreq=noraman
keyword: PBEPBE/SDD
title: #p freq=noraman PBEPBE/SDD
converged: YES YES NO NO
title: Mulliken charges:
elementType: N C C C C C C C C C C C C C C C C H H H H H H H H H H H H H
charge: -0.016715 -0.704077 0.520972 0.425816 0.498128 -0.521236 -0.072702 -0.510033 -0.401407 -0.449544 -0.376504 -0.301229 -0.247456 -0.223899 -0.217946 -0.220182 -0.247467 0.226921 0.225792 0.251050 0.254401 0.235235 0.231140 0.238491 0.260902 0.228946 0.231208 0.226275 0.226045 0.229075
chargesum: 0.00000
title: Mulliken charges with hydrogens summed into heavy atoms:
elementType: N C C C C C C C C C C C C C C C C
charge: -0.016715 -0.251363 0.520972 0.425816 0.498128 -0.270186 -0.072702 -0.255632 -0.166173 -0.218405 -0.138013 -0.040326 -0.018510 0.007309 0.008330 0.005864 -0.018393
polarizability: 2.74385889e+02 -1.18403127e+01 1.38049312e+02 -2.74911047e+01 2.33730356e+00 1.25583568e+02
1716.lowfreq: -7.1296 -1.8042 -0.0004 -0.0002 0.0006 5.8179 19.4682 27.5007 49.0680
frequency: 19.3993 27.4268 49.0521 118.2239 180.3722 184.2531 228.7342 280.4454 308.2729 402.6288 403.6502 406.2620 453.2497 480.0438 494.9411 508.5792 519.6467 595.3308 609.9421 617.5289 654.2050 702.8037 715.9073 747.6259 760.4660 769.1957 797.7275 807.6357 854.3546 872.2764 877.2707 899.9820 924.1285 944.6430 953.5027 969.0090 974.4473 977.6754 990.6950 995.4712 996.2098 1017.2163 1026.8183 1082.6449 1117.4363 1155.6156 1171.6463 1177.8630 1180.8822 1188.9196 1206.7254 1212.4249 1247.5050 1274.8341 1290.0409 1335.0663 1361.1245 1365.0685 1382.3464 1398.3177 1426.0692 1440.6048 1454.9552 1460.6088 1483.8204 1492.1191 1557.4000 1593.2514 1602.0981 1614.0050 1625.6972 2972.2331 3020.6036 3109.8969 3114.4165 3114.7202 3119.3429 3120.1968 3133.6476 3136.3582 3144.7766 3154.2928 3163.0070 3170.5520
redmass: 4.8756 3.8712 4.9007 4.9291 3.7850 4.6225 4.3718 4.5950 2.4735 3.1434 3.6476 3.1839 3.5239 2.8637 3.2785 5.6563 7.0559 4.8141 6.6232 6.5032 3.3290 2.5103 2.1440 3.2502 1.4426 2.4961 3.2978 2.7763 1.2478 2.2514 1.8057 1.8089 1.6070 1.4417 2.0257 1.5813 2.9320 1.4078 5.9818 1.3302 1.3349 2.1476 2.2153 1.5877 1.7189 1.4317 1.0662 1.1649 1.4475 1.1192 2.1151 2.2134 2.2005 1.5831 1.6162 1.3123 4.6733 1.7005 7.4078 2.5874 4.5293 2.1156 2.6123 1.1593 2.2303 3.3656 7.2081 6.0844 5.9179 6.0848 6.7020 1.0599 1.1004 1.0909 1.0920 1.0876 1.0873 1.0864 1.0910 1.0892 1.0959 1.0949 1.1015 1.0993
irintensity: 0.4696 0.0603 0.0643 1.6341 0.3679 0.4911 1.1239 1.1709 2.0665 0.7911 2.1182 0.8911 6.0813 11.2792 3.7996 2.9737 0.3125 2.9120 1.7399 0.2038 1.7668 17.8519 62.3932 16.1841 46.4488 26.9687 2.5478 24.7046 0.0063 10.7729 2.2530 14.0957 9.4436 0.2551 8.7262 8.0049 3.7152 0.1356 0.6433 0.1087 0.4530 6.6354 9.5724 12.5019 9.1335 2.2460 0.4819 2.4052 0.5163 1.9344 0.3063 0.7841 3.5758 4.9038 0.6406 0.8136 8.8081 14.5791 1.1709 2.2713 1.8546 6.9435 5.7310 16.8578 23.6984 17.2218 3.0136 1.8090 7.7945 9.9851 0.2956 27.7670 10.9412 17.2572 15.7261 8.4820 6.3940 4.3445 10.6520 12.1202 42.5742 25.7546 27.2336 24.0315
temp: 298.150 k
press: 1.00000 atm
elementType: 7 6 6 6 6 6 6 6 6 6 6 6 6 6 6 6 6 1 1 1 1 1 1 1 1 1 1 1 1 1
symmnumber: 1
zpe: 630972.6 jmol-1
zpe.correction: 0.240325 hartree
zpe.thermalcorrener: 0.253333 hartree
zpe.thermalcorrenthalpy: 0.254277 hartree
zpe.thermalcorrgfe: 0.198577 hartree
zpe.sumelectzpe: -671.103782 hartree
zpe.sumelectthermal: -671.090774 hartree
zpe.sumelectthermalent: -671.089830 hartree
zpe.sumelectthermalfe: -671.145530 hartree
dipole: 0.3065 2.3410 0.4632
dipole: 2.4060
quadrupole: -84.7031 -98.9801 -96.5502
quadrupole: -4.9746 -5.6035 -1.5352
quadrupole: 8.7081 -5.5690 -3.1391 -4.9746 -5.6035 -1.5352
hfenergy: -671.3441067 hartree
pointgroup: C01 [X(C16H13N1)]
dipole: -0.1798276 -0.563271 -0.7392035 debye
polarizability: 268.8578056|-40.68068|135.5015358|-0.4717328|7.0351198|133.6594279 unknown
InChI: InChI=1S/C16H13N/c1-2-6-13(7-3-1)10-14-11-15-8-4-5-9-16(15)17-12-14/h1-9,11-12H,10H2
charge 0 multiplicity 1
30 atoms
N  1.446307 1.201828 1.026528
C  -1.398838 0.481334 -1.43813
C  -0.03548 0.377707 -0.768226
C  2.242678 -0.522091 -0.578974
C  -2.586134 0.209565 -0.5112
C  0.966719 -0.478241 -1.232073
C  2.444413 0.349021 0.560947
C  0.268746 1.196273 0.378827
C  3.312633 -1.375681 -1.000463
C  -3.710171 1.072639 -0.506534
C  -2.599854 -0.928176 0.336801
C  3.704637 0.340033 1.237863
C  4.534349 -1.366127 -0.321553
C  4.731723 -0.503047 0.803953
C  -4.826281 0.804961 0.319406
C  -3.712704 -1.199229 1.162481
C  -4.831738 -0.333583 1.156766
H  -1.428515 -0.228466 -2.289139
H  -1.5167 1.491923 -1.877113
H  0.78639 -1.124121 -2.101304
H  -0.502403 1.870353 0.7742
H  3.161195 -2.035917 -1.863378
H  -3.712215 1.959852 -1.152476
H  -1.731763 -1.598352 0.354712
H  3.825678 1.009688 2.094995
H  5.349513 -2.020974 -0.64871
H  5.695459 -0.507499 1.324948
H  -5.68619 1.484371 0.311227
H  -3.70695 -2.08188 1.812188
H  -5.694306 -0.541962 1.799529
