program: Gaussian 09
title: 000142115
version: EM64L-G09RevD.01
frameworkgroup: C1[X(C8H6F2O2)]
method: RPBEPBE
basis: SDD
operation: Freq
keyword: #pfreq=noraman
keyword: PBEPBE/SDD
title: #p freq=noraman PBEPBE/SDD
converged: NO YES NO NO
title: Mulliken charges:
elementType: F F O O C C C C C C C C H H H H H H
charge: -0.181688 -0.181701 -0.279534 -0.195996 0.098163 0.274917 0.274871 -0.358555 -0.358546 -0.154173 0.265241 -0.740993 0.263000 0.263000 0.243183 0.259237 0.250320 0.259253
chargesum: 0.00000
title: Mulliken charges with hydrogens summed into heavy atoms:
elementType: F F O O C C C C C C C C
charge: -0.181688 -0.181701 -0.279534 -0.195996 0.098163 0.274917 0.274871 -0.095556 -0.095545 0.089010 0.265241 0.027817
polarizability: 1.20787193e+02 8.51782235e-03 9.06098692e+01 -7.95602705e+00 -6.60389875e-03 5.64160464e+01
1716.lowfreq: -27.9437 -12.6944 -6.3253 -0.0002 0.0010 0.0013 4.6338 55.3062 80.9762
frequency: -27.6386 55.2740 80.9759 91.2436 146.8738 238.8528 253.5059 285.8336 311.4971 352.5919 476.4691 478.1510 513.0691 535.5157 560.7788 567.6114 596.2285 662.3776 721.7270 762.6470 787.5187 857.8150 870.7039 956.0547 956.4574 985.0872 1042.3045 1053.7974 1143.7914 1166.0531 1180.2712 1221.7538 1258.6035 1381.0288 1385.0948 1450.7237 1452.6783 1454.1276 1470.6154 1598.8805 1613.6238 1699.9338 3011.9489 3100.0072 3149.7298 3161.1870 3181.3866 3192.2412
redmass: 12.2458 1.8383 5.9660 1.4562 14.4980 4.8789 6.6613 11.6533 6.0957 5.5017 6.6196 6.6301 4.5550 3.9328 5.0685 4.7604 5.5512 4.7887 4.1717 2.5849 2.4947 7.1251 1.3958 1.3018 7.2366 2.1685 1.6463 1.9240 3.9191 1.1113 4.1456 1.7978 3.5313 11.2015 1.2364 1.2061 1.0578 2.0574 4.0290 7.9360 8.8418 10.5617 1.0368 1.0972 1.1013 1.0877 1.0930 1.0995
irintensity: 0.0023 5.5373 5.8020 1.1694 0.2047 0.0017 6.1403 0.2324 0.6509 2.3941 1.4611 12.7814 2.0937 0.1424 0.1776 4.9209 5.1643 1.5355 16.8044 94.4558 29.6996 76.0443 0.0401 1.7465 111.4274 87.0940 8.7352 30.8807 307.4493 0.7539 83.9248 17.0841 66.2435 0.2964 61.2543 62.2833 27.8004 29.7383 77.5315 50.3692 12.3479 173.8726 0.4097 3.6411 8.3689 4.9152 1.4191 1.9644
temp: 298.150 k
press: 1.00000 atm
elementType: 9 9 8 8 6 6 6 6 6 6 6 6 1 1 1 1 1 1
symmnumber: 1
zpe: 319849.4 jmol-1
zpe.correction: 0.121824 hartree
zpe.thermalcorrener: 0.132110 hartree
zpe.thermalcorrenthalpy: 0.133054 hartree
zpe.thermalcorrgfe: 0.085199 hartree
zpe.sumelectzpe: -657.704417 hartree
zpe.sumelectthermal: -657.694131 hartree
zpe.sumelectthermalent: -657.693187 hartree
zpe.sumelectthermalfe: -657.741042 hartree
dipole: -1.2987 0.0032 -1.0153
dipole: 1.6485
quadrupole: -47.0149 -69.7735 -74.1099
quadrupole: 0.0089 -5.4391 0.0043
quadrupole: 16.6178 -6.1407 -10.4771 0.0089 -5.4391 0.0043
hfenergy: -657.8262414 hartree
pointgroup: C01 [X(C8H6F2O2)]
dipole: -0.5131056 0.0009361 -0.3966648 debye
dipolederiv: -0.3746776 0.3360011 0.0584422 0.2894469 -0.8044773 -0.0861544 0.0540928 -0.0739269 -0.1389162 -0.3743137 -0.3357315 0.0584727 -0.2891621 -0.8048073 0.0863851 0.0541673 0.0741824 -0.1389801 -1.8184743 -0.0005417 -0.3023244 -0.0002291 -0.2293764 0.0000413 -0.3872654 -0.000094 -0.5882555 -0.5993214 -0.0002799 0.1606186 -0.0001886 -0.2549394 0.0003892 -0.3821754 0.000368 -0.9332604 0.943982 0.0002911 0.0038459 0.0002667 -0.1295042 0.0000533 -0.2626932 -0.0000388 -0.0193551 0.3894594 -0.3454395 -0.1024726 -0.2821173 0.9154847 0.0968215 -0.0496356 0.0665365 0.134532 0.3890857 0.3450669 -0.1025234 0.2817477 0.9157671 -0.0971034 -0.0498861 -0.0668354 0.1345768 -0.2091561 0.1764561 0.0000843 0.0207953 -0.1031479 -0.0215094 0.0018763 -0.0431226 -0.1644813 -0.2090368 -0.1765089 0.0001442 -0.0208607 -0.1032449 0.0214779 0.0018585 0.0430691 -0.1645172 0.0978788 -0.0000251 -0.0608531 -0.0000331 0.1472822 -0.0000756 -0.0566017 -0.0000706 -0.1234059 1.8852476 0.0011746 0.1096685 0.0012364 0.2058129 -0.0008135 0.887858 -0.0004432 1.4304883 -0.3734531 -0.0008471 0.1378551 -0.0022787 0.0133935 0.001015 0.1937517 0.0004265 -0.1216135 0.0706274 -0.0467205 0.0190088 -0.0484653 -0.002337 0.0095892 0.02665 0.012241 0.183674 0.0705743 0.0467732 0.0189985 0.0485226 -0.0022938 -0.0095076 0.0266405 -0.0121439 0.1836837 -0.0666064 -0.0000386 0.049433 -0.0000382 0.0899036 0.0000288 0.0521805 0.0000317 0.152614 0.100537 -0.0239369 0.0028869 0.0172708 0.0090202 -0.0942873 -0.0059849 -0.085195 0.0824094 -0.0226521 0.0004496 -0.0546324 0.0009113 0.130297 0.0004394 -0.0990295 0.0007126 0.0063854 0.1002993 0.0238571 0.0033475 -0.0168247 0.0071669 0.0932105 -0.0058036 0.0843027 0.0844218 unknown
polarizability: 120.699347|0.0167|90.6098691|-8.3032996|-0.0211083|56.5038924 unknown
InChI: InChI=1S/C8H6F2O2/c1-5(11)12-8-6(9)3-2-4-7(8)10/h2-4H,1H3
charge 0 multiplicity 1
18 atoms
F  -0.103697 -2.410337 -0.274976
F  -0.105176 2.409012 -0.27584
O  1.269206 -0.000262 -0.691596
O  1.967223 -0.000849 1.551609
C  -0.088065 -0.000665 -0.297925
C  -0.802227 -1.204798 -0.127977
C  -0.802972 1.203093 -0.128421
C  -2.171152 -1.23068 0.18289
C  -2.171921 1.228256 0.182403
C  -2.851751 -0.001393 0.335767
C  2.263237 -0.000324 0.348245
C  3.629458 0.00135 -0.286741
H  -2.678824 -2.191157 0.302995
H  -2.680183 2.188469 0.302128
H  -3.918115 -0.001679 0.57901
H  3.743138 -0.883811 -0.935818
H  4.402457 -0.003375 0.494109
H  3.744964 0.893448 -0.92606
