program: Gaussian 09
title: 000142109
version: EM64L-G09RevD.01
frameworkgroup: C1[X(C4H7N3S)]
method: RPBEPBE
basis: SDD
operation: Freq
keyword: #pfreq=noraman
keyword: PBEPBE/SDD
title: #p freq=noraman PBEPBE/SDD
converged: YES YES NO NO
title: Mulliken charges:
elementType: S N N N C C C C H H H H H H H
charge: 0.217956 -0.077065 -0.067390 -0.098937 -0.217224 -0.186479 -0.592094 -0.821179 0.286532 0.229122 0.261110 0.260861 0.239324 0.282671 0.282791
chargesum: 0.00000
title: Mulliken charges with hydrogens summed into heavy atoms:
elementType: S N N N C C C C
charge: 0.217956 -0.077065 -0.067390 -0.098937 0.069308 -0.186479 0.158999 -0.016393
polarizability: 1.16895285e+02 2.43902443e+00 7.63244390e+01 1.65953717e-02 -4.85273216e-03 4.13381143e+01
1716.lowfreq: -115.5160 -8.0152 -5.7199 -5.1292 -0.0013 0.0006 0.0015 33.8741 121.9770
frequency: -115.5076 33.5225 121.9632 155.6926 160.1240 269.5850 286.2126 397.8007 435.3698 614.4098 653.7023 655.4859 682.6885 761.6433 928.6668 958.5330 977.1313 995.3335 1023.6013 1073.1848 1122.8042 1140.2524 1210.7510 1236.3353 1346.8253 1398.2739 1432.6703 1436.0329 1454.4489 1458.9777 1476.5749 1490.8043 3013.0645 3025.8436 3108.4561 3128.2050 3151.9626 3154.9748 3260.4220
redmass: 1.0591 3.7677 1.1543 3.4479 2.7394 3.7352 6.4476 3.9668 9.2260 4.3746 7.2624 6.2034 4.7532 1.4882 5.1112 8.0468 1.1737 1.2661 2.7594 2.1789 1.3241 4.9232 2.9478 3.5690 1.1353 3.5683 1.5411 1.0524 1.0560 1.0405 2.6212 1.2175 1.0332 1.0279 1.1025 1.1022 1.1046 1.1060 1.1007
irintensity: 0.3198 13.8900 0.2492 7.7635 0.3992 4.0154 0.4382 3.1891 0.7611 4.6319 3.9275 3.3294 1.0007 39.6349 2.9288 21.1641 8.7511 10.3949 11.2242 0.8409 2.2083 10.5866 27.7785 41.7055 1.0828 28.2340 28.0861 13.8803 19.5272 16.3562 25.0185 6.3241 33.4569 21.3428 13.1040 8.5167 8.8735 11.2567 1.8595
temp: 298.150 k
press: 1.00000 atm
elementType: 16 7 7 7 6 6 6 6 1 1 1 1 1 1 1
symmnumber: 1
zpe: 294474.7 jmol-1
zpe.correction: 0.112160 hartree
zpe.thermalcorrener: 0.120284 hartree
zpe.thermalcorrenthalpy: 0.121228 hartree
zpe.thermalcorrgfe: 0.078187 hartree
zpe.sumelectzpe: -718.275004 hartree
zpe.sumelectthermal: -718.266879 hartree
zpe.sumelectthermalent: -718.265935 hartree
zpe.sumelectthermalfe: -718.308976 hartree
dipole: -2.2488 -2.5299 0.0250
dipole: 3.3850
quadrupole: -38.9124 -58.7353 -56.4739
quadrupole: 8.4844 0.0077 0.0139
quadrupole: 12.4615 -7.3615 -5.1000 8.4844 0.0077 0.0139
hfenergy: -718.3871633 hartree
pointgroup: C01 [X(C4H7N3S1)]
dipole: -0.920181 0.9589297 0.0854514 debye
dipolederiv: -0.4470507 0.0437722 0.0103668 -0.0782897 0.0062025 0.0088294 -0.0011233 0.0058238 -0.0709152 -0.6507197 0.1571985 0.0230244 0.1191516 -0.0036189 0.001907 0.0156631 0.0019841 -0.0500904 -0.0449206 -0.3293009 -0.0279828 -0.3556429 -0.064323 0.0131 -0.0301563 0.0123798 -0.153973 -0.5561455 0.156517 0.0189215 -0.2045099 -0.1176989 0.0081718 -0.0115479 0.0021511 -0.1737527 0.0110207 -0.1448442 -0.0138693 0.1971029 -0.1022199 0.0002358 0.0153429 0.0051127 -0.1433685 0.8703198 0.2499174 0.0055765 0.3855988 -0.1183872 -0.0130007 0.0168509 -0.0096716 -0.0585312 0.5062403 0.0088975 -0.0060624 -0.0303877 0.139301 -0.0043383 -0.0068086 -0.005314 0.1938053 0.1303743 -0.1414257 -0.0139416 -0.1239062 0.1154941 0.0068205 -0.0108369 0.0073913 0.058509 0.1133666 0.026523 0.0037556 0.0138674 0.036831 -0.0159502 0.0027541 -0.0161229 0.2329144 0.0351064 -0.0150639 0.0007015 0.0757332 -0.0865346 -0.0160013 0.0071092 -0.0149938 0.1304509 -0.0156512 0.0041933 -0.0317516 -0.0451665 0.0928016 -0.0751981 -0.0971824 -0.0522777 -0.0326632 -0.0144405 0.0016174 0.0325657 -0.0544098 0.0721709 0.0919589 0.0910342 0.0676222 -0.0180694 -0.1249674 -0.0230576 0.0036281 -0.0455692 0.0748358 -0.0033663 0.0016476 -0.0037689 0.1272157 0.0920825 0.0044602 -0.0455036 0.0738654 -0.0088906 -0.0895965 -0.0268227 -0.068434 -0.032677 0.0953851 0.0005958 0.0405712 0.0725627 -0.035964 0.0864278 0.0340763 0.0681179 -0.0088546 unknown
polarizability: 116.9958534|-0.8554463|75.9611683|-1.3842438|2.8821025|41.6008166 unknown
InChI: InChI=1S/C4H7N3S/c1-7-3-4(8-2)5-6-7/h3H,1-2H3
charge 0 multiplicity 1
15 atoms
S  2.275451 1.066385 -0.123192
N  -1.588409 0.131224 -0.138979
N  -1.025605 -1.149386 -0.250581
N  0.322402 -0.975172 -0.257088
C  -0.606403 1.101111 -0.075994
C  0.601269 0.387698 -0.151724
C  -3.046913 0.276159 -0.103209
C  3.25211 -0.538166 -0.28283
H  -0.817324 2.161738 0.012008
H  -3.306619 1.342973 -0.025359
H  -3.488228 -0.139862 -1.023364
H  -3.457601 -0.263249 0.765727
H  4.310886 -0.236937 -0.281493
H  2.987102 -1.042058 -1.222607
H  3.028782 -1.195758 0.568685
