program: Gaussian 09
title: 000142104
version: EM64L-G09RevD.01
frameworkgroup: C1[X(C12H18O)]
method: RPBEPBE
basis: SDD
operation: Freq
keyword: #pfreq=noraman
keyword: PBEPBE/SDD
title: #p freq=noraman PBEPBE/SDD
converged: YES YES NO NO
title: Mulliken charges:
elementType: O C C C C C C C C C C C C H H H H H H H H H H H H H H H H H H
charge: -0.466803 -0.018688 -0.241649 -0.388526 0.482530 -0.406017 -0.787525 -0.717976 -0.395166 -0.458828 -0.242110 -0.227180 -0.248936 0.238537 0.206465 0.226250 0.192954 0.210604 0.207415 0.206821 0.246286 0.213535 0.213800 0.214727 0.223210 0.276255 0.223981 0.349631 0.220480 0.221457 0.224468
chargesum: 0.00000
title: Mulliken charges with hydrogens summed into heavy atoms:
elementType: O C C C C C C C C C C C C
charge: -0.117172 0.219849 -0.035185 0.030678 0.482530 0.012002 -0.120883 -0.066240 -0.118911 -0.234847 -0.021630 -0.005723 -0.024468
polarizability: 1.56574425e+02 -7.96485350e+00 1.19333004e+02 -6.54715403e+00 -1.38724001e+01 1.08445462e+02
1716.lowfreq: -8.4650 -0.0006 -0.0001 0.0002 8.0747 11.9102 34.9379 48.9718 87.6884
frequency: 34.3579 48.7534 87.6702 97.3038 121.2877 162.8594 200.7274 217.5863 239.0873 250.3814 261.9837 293.1131 311.5188 331.9028 396.6385 405.3348 510.6445 516.4195 562.0250 616.5923 640.6034 706.2423 763.6948 772.3410 783.1942 805.7100 853.3227 878.2166 913.5280 921.2868 974.0814 981.0868 985.9157 989.0071 993.4100 1005.8527 1016.1656 1033.1621 1048.4494 1077.1511 1098.7479 1148.4052 1152.5019 1169.8397 1187.5012 1192.7433 1196.6130 1219.5666 1269.0081 1279.7735 1293.4548 1311.1454 1333.6780 1350.7706 1351.9768 1380.1817 1382.4160 1388.1841 1402.2108 1440.3017 1463.9182 1471.5979 1475.4017 1481.4033 1484.9000 1487.1610 1500.4743 1589.2071 1611.6478 2947.6564 2970.1470 2970.5777 2974.9137 2979.6314 3001.8252 3003.9977 3027.9709 3059.1328 3068.4554 3073.9229 3081.1211 3107.0169 3121.1478 3134.5692 3152.5224 3164.5298 3581.4033
redmass: 3.2668 3.2791 3.5421 2.2576 4.0538 3.5131 1.4809 1.1506 1.5709 2.0571 1.7812 3.9016 2.9103 2.1872 2.2518 2.8125 3.0550 2.5863 3.6063 6.2949 3.9130 1.6138 1.5665 2.1209 1.9825 2.5992 1.2492 2.3068 1.7909 1.7353 1.4011 2.0752 1.4817 3.9502 1.4656 1.6857 2.3223 1.8099 2.0591 1.6875 1.7603 2.1350 1.5999 1.0601 1.1167 1.5468 1.6582 1.1886 1.3712 1.1944 1.5331 1.5425 1.3632 1.4457 1.3331 1.7734 2.4211 1.2219 1.3151 2.1451 1.0686 1.0705 1.1733 1.6754 1.1193 1.0506 1.0605 5.9950 6.1188 1.0572 1.0508 1.0591 1.0573 1.0456 1.1003 1.0908 1.0987 1.0984 1.0986 1.0999 1.0987 1.0871 1.0863 1.0927 1.0964 1.0986 1.0666
irintensity: 0.4607 0.2140 0.7290 0.1439 1.7792 3.4796 17.7509 126.7633 0.2788 1.6830 0.3232 3.1498 0.1897 0.9084 0.5236 0.0982 7.8868 0.7399 15.5278 0.1589 14.5779 64.3909 11.3655 30.0203 6.3722 14.0511 0.2496 3.9359 4.0209 7.8736 0.0971 10.0645 2.2293 0.6741 0.9611 16.3403 15.8755 2.7418 26.1528 21.3447 2.8776 4.1282 12.0828 0.0965 1.2543 5.1536 11.5669 7.3950 11.8069 6.0346 2.2412 1.5090 3.5352 1.4154 0.7341 8.0316 6.4013 25.7885 1.3944 9.3128 0.4678 20.5973 3.4720 14.7894 10.1079 12.0632 8.6049 1.2050 7.8713 43.4156 45.5922 28.7148 6.5324 45.2029 44.3744 56.1415 17.9101 40.2550 71.7943 59.1950 29.2713 12.7136 0.8070 35.8707 31.2615 12.0895 3.4983
temp: 298.150 k
press: 1.00000 atm
elementType: 8 6 6 6 6 6 6 6 6 6 6 6 6 1 1 1 1 1 1 1 1 1 1 1 1 1 1 1 1 1 1
symmnumber: 1
zpe: 707853.6 jmol-1
zpe.correction: 0.269607 hartree
zpe.thermalcorrener: 0.283580 hartree
zpe.thermalcorrenthalpy: 0.284524 hartree
zpe.thermalcorrgfe: 0.228753 hartree
zpe.sumelectzpe: -542.279013 hartree
zpe.sumelectthermal: -542.265040 hartree
zpe.sumelectthermalent: -542.264096 hartree
zpe.sumelectthermalfe: -542.319867 hartree
dipole: -0.3584 1.0217 1.3805
dipole: 1.7544
quadrupole: -78.2647 -73.7625 -77.9013
quadrupole: -1.9990 -2.5073 0.6562
quadrupole: -1.6219 2.8803 -1.2585 -1.9990 -2.5073 0.6562
hfenergy: -542.5486204 hartree
pointgroup: C01 [X(C12H18O1)]
dipole: -0.1061803 0.5215997 0.4394391 debye
polarizability: 155.3606591|-11.551155|113.4604032|-6.2913692|-14.3179589|115.5318283 unknown
InChI: InChI=1S/C12H18O/c1-3-10(2)12(9-13)11-7-5-4-6-8-11/h4-8,10,12-13H,3,9H2,1-2H3
charge 0 multiplicity 1
31 atoms
O  -1.060583 2.603588 -0.70651
C  -1.862925 -0.164848 -0.468667
C  -0.854353 0.490146 0.537491
C  -1.727352 -1.715148 -0.507916
C  0.601797 0.137645 0.222186
C  -1.054324 2.01911 0.64988
C  -3.322155 0.272813 -0.195178
C  -2.092585 -2.452168 0.801271
C  1.20768 0.534751 -1.00084
C  1.384688 -0.588497 1.156152
C  2.55504 0.212313 -1.275569
C  2.733256 -0.914902 0.883085
C  3.324422 -0.515217 -0.336875
H  -1.594942 0.209833 -1.476542
H  -1.086481 0.094596 1.549076
H  -0.691381 -1.980131 -0.794651
H  -2.383031 -2.088704 -1.320794
H  -0.231353 2.451541 1.256401
H  -2.019494 2.233837 1.154264
H  -3.620759 0.094129 0.855793
H  -3.46091 1.345076 -0.417039
H  -4.018724 -0.295373 -0.840121
H  -1.411273 -2.179997 1.628672
H  -2.017328 -3.546542 0.663049
H  -3.125827 -2.226694 1.122866
H  0.618769 1.111737 -1.720517
H  0.934069 -0.902651 2.106867
H  -0.979068 3.586855 -0.639251
H  3.007538 0.529741 -2.222538
H  3.318631 -1.479071 1.618514
H  4.368956 -0.766964 -0.55346
