program: Gaussian 09
title: 000142101
version: EM64L-G09RevD.01
frameworkgroup: C1[X(C11H20O2)]
method: RPBEPBE
basis: SDD
operation: Freq
keyword: #pfreq=noraman
keyword: PBEPBE/SDD
title: #p freq=noraman PBEPBE/SDD
converged: YES YES NO NO
title: Mulliken charges:
elementType: O O C C C C C C C C C C C H H H H H H H H H H H H H H H H H H H H
charge: -0.275103 -0.232768 -0.015203 -0.453041 -0.455883 -0.165321 -0.409777 -0.409244 -0.382421 -0.409062 0.169547 -0.707130 -0.502997 0.223855 0.191091 0.206024 0.217699 0.198855 0.240204 0.197468 0.193117 0.191898 0.198275 0.199411 0.188962 0.213330 0.220143 0.228113 0.214433 0.217193 0.239996 0.238918 0.229420
chargesum: 0.00000
title: Mulliken charges with hydrogens summed into heavy atoms:
elementType: O O C C C C C C C C C C C
charge: -0.275103 -0.232768 0.208651 -0.055927 -0.039329 0.074883 -0.019192 -0.019071 0.005952 0.024410 0.169547 -0.047390 0.205336
polarizability: 1.37249172e+02 2.12559412e+00 1.21012122e+02 -3.52573530e-01 1.57800629e-01 1.05873016e+02
1716.lowfreq: -5.6867 -0.0006 -0.0005 -0.0004 6.5301 28.6892 40.8418 45.7939 73.2396
frequency: 40.7635 45.7278 73.2171 80.0802 97.4365 111.2563 151.0693 178.6124 203.1730 216.1893 235.5459 276.9626 298.0977 316.2281 336.3602 418.0934 424.6115 438.1709 481.2160 555.0820 642.0599 704.9335 756.5469 780.7745 795.8055 807.2950 844.8160 884.7049 890.2685 895.8796 922.8599 962.9955 967.2994 1029.4398 1049.8978 1057.4062 1060.9419 1073.5470 1085.9223 1097.8638 1110.5786 1117.1050 1140.4964 1150.7585 1175.7220 1205.4194 1217.4616 1256.5614 1257.9028 1263.2733 1272.1068 1305.1202 1311.7489 1316.5734 1328.9167 1334.0709 1337.8937 1341.4580 1346.1281 1363.9967 1393.3950 1421.4054 1450.6316 1455.7716 1460.8618 1462.4797 1464.7059 1465.2031 1468.5079 1475.3712 1477.2343 1482.8196 1635.4157 2954.1265 2958.3155 2964.6476 2965.0413 2965.6460 2969.9856 2978.0290 2993.1737 3000.5970 3001.4573 3021.6657 3026.5870 3028.1485 3031.7849 3041.7699 3048.9290 3075.9101 3079.2605 3100.7593 3144.7867
redmass: 2.8474 5.1840 2.4345 2.7012 1.2097 2.3507 2.5602 2.5653 3.5660 1.7863 1.4153 3.7217 2.3913 2.9177 2.7209 2.5451 2.6100 2.7951 2.3970 2.2234 2.9878 4.6516 3.6828 1.4917 2.2426 1.5598 1.9686 2.3146 1.6428 1.4672 2.1513 2.3692 3.5504 2.1662 2.1078 1.4046 1.5767 1.4851 1.9355 2.4856 1.2684 2.4528 1.7947 1.7581 2.0639 1.9365 1.6093 1.2416 1.2782 1.2700 1.2821 1.2142 1.2393 1.3144 1.4097 1.4546 1.4131 1.5074 1.5188 1.4632 1.2100 1.1783 1.0508 1.0878 1.0909 1.0895 1.0560 1.0752 1.0790 1.0951 1.0484 1.0532 9.3928 1.0663 1.0658 1.0622 1.0588 1.0677 1.0748 1.0356 1.0640 1.0367 1.0731 1.0961 1.0956 1.1010 1.0988 1.1029 1.1003 1.0993 1.1014 1.1043 1.1046
irintensity: 0.0877 1.2186 0.1339 0.3040 0.0436 0.1117 1.5703 2.2675 6.3791 0.2119 2.2162 0.8759 5.5112 3.7043 3.1047 1.1891 0.8169 1.2832 2.4073 4.4513 0.8669 3.3348 9.9972 0.1568 0.5427 17.9761 7.1565 3.9132 7.1603 2.4767 0.3646 6.1167 31.9364 19.1826 51.9885 2.5029 19.5686 8.9592 9.2870 4.5262 0.0423 0.5994 32.4389 1.0914 52.7782 34.5537 28.0504 4.0985 2.2451 11.0810 6.7681 6.8694 0.3635 2.7682 0.5670 0.6390 0.6796 0.6272 0.9209 2.0863 11.8304 15.2292 12.5193 2.8329 3.1300 8.3323 8.6416 3.7045 24.2651 1.9052 7.7991 7.8134 170.5715 21.5741 19.4142 25.8017 37.1213 30.5573 30.2144 32.4926 10.7962 34.0880 24.6065 89.7721 78.2170 15.5692 2.1260 141.7639 3.4924 46.1688 65.4189 27.8622 16.2536
temp: 298.150 k
press: 1.00000 atm
elementType: 8 8 6 6 6 6 6 6 6 6 6 6 6 1 1 1 1 1 1 1 1 1 1 1 1 1 1 1 1 1 1 1 1
symmnumber: 1
zpe: 765053.0 jmol-1
zpe.correction: 0.291393 hartree
zpe.thermalcorrener: 0.306203 hartree
zpe.thermalcorrenthalpy: 0.307148 hartree
zpe.thermalcorrgfe: 0.249025 hartree
zpe.sumelectzpe: -580.566717 hartree
zpe.sumelectthermal: -580.551907 hartree
zpe.sumelectthermalent: -580.550963 hartree
zpe.sumelectthermalfe: -580.609085 hartree
dipole: 0.6331 0.2410 -1.8989
dipole: 2.0161
quadrupole: -79.1146 -76.5972 -84.7833
quadrupole: 1.6575 6.6076 4.1743
quadrupole: 1.0504 3.5678 -4.6183 1.6575 6.6076 4.1743
hfenergy: -580.8581106 hartree
pointgroup: C01 [X(C11H20O2)]
dipole: 0.2550353 0.1075159 -0.7433418 debye
polarizability: 137.2698979|2.0592677|120.9833105|-0.0798338|0.453462|105.8811021 unknown
InChI: InChI=1S/C11H20O2/c1-3-10(11(12)13-2)9-7-5-4-6-8-9/h9-10H,3-8H2,1-2H3
charge 0 multiplicity 1
33 atoms
O  -1.925329 -0.88513 -0.902753
O  -2.1901 -0.961078 1.406363
C  0.733002 0.234055 -0.170725
C  1.812476 1.342202 -0.042442
C  1.22325 -1.059033 0.537766
C  -0.648236 0.70648 0.395129
C  3.190882 0.874546 -0.568534
C  2.597904 -1.529566 0.008694
C  3.662856 -0.416623 0.139086
C  -1.240991 1.923805 -0.374607
C  -1.65072 -0.443915 0.401468
C  -2.620453 2.376208 0.151179
C  -2.889827 -2.005196 -1.009373
H  0.590203 0.00417 -1.248052
H  1.907287 1.627114 1.027416
H  1.504948 2.251789 -0.591616
H  0.479988 -1.869906 0.409004
H  1.294514 -0.8669 1.629244
H  -0.51713 0.983571 1.460531
H  3.936504 1.682453 -0.434747
H  3.118109 0.683902 -1.65962
H  2.499266 -1.815018 -1.059376
H  2.920235 -2.437677 0.554305
H  4.629515 -0.755332 -0.281683
H  3.83654 -0.20194 1.214215
H  -0.532812 2.768919 -0.292758
H  -1.315312 1.660555 -1.446968
H  -3.384493 1.58854 0.017475
H  -2.968893 3.275358 -0.388816
H  -2.57798 2.620755 1.22887
H  -3.862947 -1.71655 -0.57713
H  -2.509443 -2.891269 -0.473208
H  -2.976414 -2.20079 -2.087538
