program: Gaussian 09
title: 000142098
version: EM64L-G09RevD.01
frameworkgroup: C1[X(C6H2Cl2F2)]
method: RPBEPBE
basis: SDD
operation: Freq
keyword: #p
keyword: freq=noraman
keyword: PBEPBE/SDD
title: #p freq=noraman PBEPBE/SDD
converged: NO NO NO NO
title: Mulliken charges:
elementType: Cl Cl F F C C C C C C H H
charge: 0.052740 0.052714 -0.171222 -0.171222 -0.277335 -0.277290 0.437643 0.437636 -0.312909 -0.312899 0.271071 0.271072
chargesum: 0.00000
title: Mulliken charges with hydrogens summed into heavy atoms:
elementType: Cl Cl F F C C C C C C
charge: 0.052740 0.052714 -0.171222 -0.171222 -0.277335 -0.277290 0.437643 0.437636 -0.041837 -0.041826
polarizability: 9.81339526e+01 -1.17340229e-04 1.09738365e+02 4.62380337e-04 1.17735088e-02 3.11310428e+01
1716.lowfreq: -11.0994 -5.0062 -0.0022 -0.0005 0.0024 14.0736 91.2389 138.0510 188.1327
frequency: 91.2185 138.0484 188.1327 219.7049 225.5089 287.2589 349.7043 355.2161 434.5299 497.6159 505.5696 523.2913 575.8691 693.4472 709.8942 794.0880 803.7124 907.3362 920.1696 1069.5692 1131.0678 1215.7002 1259.4611 1360.4140 1374.7796 1450.5297 1582.9570 1590.3125 3172.3280 3190.3373
redmass: 22.7453 9.9443 31.5174 21.4453 7.4743 20.5246 8.0853 21.3718 14.1236 4.7657 11.9340 5.3562 4.2454 8.6496 7.0561 11.1732 1.4496 7.5828 1.3326 5.8849 1.2415 1.8183 9.7037 11.5406 5.5588 3.6677 8.9132 7.7889 1.0890 1.0982
irintensity: 0.0000 2.7423 0.0020 0.0790 1.8955 1.1378 0.0000 0.0000 0.0146 0.0000 17.7704 2.6168 2.5849 2.7638 0.0000 88.5669 68.4697 51.4164 0.0000 0.0018 0.1937 55.0768 2.3992 0.2139 22.9324 235.7465 2.6782 11.1276 0.4529 0.0912
temp: 298.150 k
press: 1.00000 atm
elementType: 17 17 9 9 6 6 6 6 6 6 1 1
symmnumber: 1
zpe: 165191.0 jmol-1
zpe.correction: 0.062918 hartree
zpe.thermalcorrener: 0.071649 hartree
zpe.thermalcorrenthalpy: 0.072593 hartree
zpe.thermalcorrgfe: 0.028205 hartree
zpe.sumelectzpe: -1348.909806 hartree
zpe.sumelectthermal: -1348.901075 hartree
zpe.sumelectthermalent: -1348.900131 hartree
zpe.sumelectthermalfe: -1348.944519 hartree
dipole: -0.0001 2.4008 0.0002
dipole: 2.4008
quadrupole: -77.6750 -60.3014 -69.9889
quadrupole: 0.0001 -0.0010 0.0009
quadrupole: -8.3532 9.0204 -0.6672 0.0001 -0.0010 0.0009
hfenergy: -1348.9727243 hartree
pointgroup: C01 [X(C6H2Cl2F2)]
dipole: 0.0000275 -0.9445302 0.0000729 debye
dipolederiv: -0.1961268 -0.2569082 0.0000771 -0.2967505 -0.4246921 0.0001256 0.0001484 0.0002534 0.0142533 -0.1961139 0.2568919 -0.0000568 0.2967325 -0.4247212 0.0000727 -0.0001123 0.0000938 0.0142322 -1.0021437 0.1139785 0.00012 0.0370666 -0.181538 -0.0000048 0.0004815 -0.0000497 -0.1198037 -1.0021274 -0.1139321 0.0000073 -0.0370196 -0.1815269 0.0000048 0.0000327 -0.0000308 -0.1198027 0.1602858 0.3951278 -0.0001184 0.6814916 0.540609 -0.0002348 -0.0001801 -0.0003543 -0.0533878 0.1602333 -0.3951158 0.000155 -0.6814514 0.5406619 -0.0001085 0.0002483 -0.0000675 -0.0533697 1.0506772 -0.2194056 -0.0002293 -0.142562 0.0373284 0.0000457 -0.0005809 0.0001347 0.1197438 1.0506664 0.2193734 -0.0000369 0.1424926 0.0373034 0.0000279 -0.0001415 0.0000842 0.1197348 -0.0767017 0.1503719 0.0000472 -0.1310873 0.0036428 0.0000623 0.0000909 -0.0000219 -0.1488275 -0.0766903 -0.1503821 0.0000433 0.1310877 0.0036368 0.0000184 0.0000212 -0.0000316 -0.1488207 0.0640227 0.039977 0.000003 0.0454615 0.0246465 -0.000012 -0.0000012 -0.0000378 0.1880241 0.0640182 -0.0399765 -0.0000115 -0.0454618 0.0246493 0.0000027 -0.000007 0.0000274 0.1880238 unknown
polarizability: 98.1339526|0.0002489|109.7383647|-0.0004628|-0.0117735|31.1310428 unknown
InChI: InChI=1S/C6H2Cl2F2/c7-5-3(9)1-2-4(10)6(5)8/h1-2H
charge 0 multiplicity 1
12 atoms
Cl 1.647765 2.218828 -0.000359
Cl -1.647731 2.218908 -0.00024
F  2.783939 -0.552629 -0.000256
F  -2.784033 -0.552486 0.00018
C  0.707422 0.68867 0.000307
C  -0.707432 0.688681 0.000176
C  1.390656 -0.549707 0.000405
C  -1.390744 -0.549637 0.000172
C  0.704753 -1.775923 0.000376
C  -0.704901 -1.775891 0.000262
H  1.27479 -2.708888 0.000272
H  -1.274984 -2.708827 0.000205
