program: Gaussian 09
title: 000010351
version: EM64L-G09RevD.01
frameworkgroup: C1[X(C5H4O2)]
method: RPBEPBE
basis: SDD
operation: Freq
keyword: #p
keyword: freq=noraman
keyword: PBEPBE/SDD
title: #p freq=noraman PBEPBE/SDD
converged: NO YES NO YES
title: Mulliken charges:
elementType: O O C C C C C H H H H
charge: -0.195897 -0.200341 0.301744 -0.334379 -0.246445 -0.140377 -0.189278 0.287002 0.280350 0.268985 0.168636
chargesum: 0.00000
title: Mulliken charges with hydrogens summed into heavy atoms:
elementType: O O C C C C C
charge: -0.195897 -0.200341 0.301744 -0.047377 0.033904 0.128608 -0.020642
polarizability: 8.01061152e+01 -1.64608793e+00 5.96744444e+01 -7.61309981e-03 4.59101570e-03 2.41560474e+01
1716.lowfreq: -4.7183 -0.0010 -0.0008 -0.0008 1.5178 14.5607 139.5495 187.5498 281.6768
frequency: 139.5344 187.5470 281.6765 477.7519 585.8761 624.1102 728.4146 741.8181 792.0468 844.3965 887.2635 958.9469 967.3558 979.2728 1058.1230 1123.4937 1212.5097 1255.7341 1362.2183 1409.9227 1486.1572 1548.2842 1618.1351 2886.3729 3237.2931 3251.4918 3277.3139
redmass: 5.9835 5.6442 2.4506 7.8930 3.6726 2.6968 4.9870 1.3154 1.3997 6.1725 1.3290 2.6116 5.3408 1.7946 2.1615 2.1355 1.2559 1.7655 2.0653 2.1801 4.6652 6.0988 6.6501 1.0850 1.0929 1.0990 1.1094
irintensity: 8.4385 11.3673 10.5041 0.1461 17.7654 11.9380 40.1539 18.4787 81.4357 23.4551 7.1826 15.7614 0.5381 5.3890 18.1646 76.2656 3.1128 16.8850 3.0649 10.1748 19.2960 1.9632 256.6080 112.9338 3.7007 1.2593 0.0771
temp: 298.150 k
press: 1.00000 atm
elementType: 8 8 6 6 6 6 6 1 1 1 1
symmnumber: 1
zpe: 202905.0 jmol-1
zpe.correction: 0.077282 hartree
zpe.thermalcorrener: 0.082994 hartree
zpe.thermalcorrenthalpy: 0.083938 hartree
zpe.thermalcorrgfe: 0.047605 hartree
zpe.sumelectzpe: -342.833184 hartree
zpe.sumelectthermal: -342.827472 hartree
zpe.sumelectthermalent: -342.826528 hartree
zpe.sumelectthermalfe: -342.862861 hartree
dipole: -2.6041 1.1162 0.0009
dipole: 2.8332
quadrupole: -48.9539 -32.8788 -41.7506
quadrupole: 6.3474 0.0029 -0.0006
quadrupole: -7.7594 8.3157 -0.5562 6.3474 0.0029 -0.0006
hfenergy: -342.9104662 hartree
pointgroup: C01 [X(C5H4O2)]
dipole: -1.0282483 0.4303432 0.0003555 debye
dipolederiv: -0.8132516 0.0875496 0.0000685 -0.1366243 -0.3283094 -0.0000091 0.0000786 -0.0000163 -0.1398008 -0.9744069 0.0979814 -0.0000194 0.3677963 -0.5248415 0.0000377 0.0003329 -0.0001335 -0.340237 -0.837004 0.0111468 0.0000925 0.0407606 -0.0252999 0.0000129 -0.0000239 -0.0000049 -0.0111368 -0.0507989 -0.0070674 -0.0000058 0.0624166 -0.0128369 0.0000029 -0.0000135 -0.0000056 -0.168798 0.7353116 -0.0491894 -0.0000405 -0.1565178 -0.0003038 0.0000047 -0.0001726 0.0000563 -0.0927048 0.0910128 -0.0789588 -0.0000212 0.0241676 0.2346611 0.000039 -0.0000132 0.0000348 -0.1372427 1.5677871 -0.053238 -0.0001335 -0.0469013 0.7624966 -0.0000945 -0.0002942 -0.0000284 0.1280445 0.1293129 0.0499245 0.0000059 0.0099093 0.0456575 -0.0000116 -0.0000012 -0.0000152 0.2011645 0.0994784 0.00156 0.0000101 -0.020413 0.040113 -0.0000033 0.0000116 -0.0000349 0.2203177 0.0459639 -0.0512047 0.0000178 -0.0234203 0.0772229 -0.0000148 0.0000088 -0.0000161 0.2290427 0.0065947 -0.0085042 0.0000257 -0.1211737 -0.2685597 0.0000362 0.0000867 0.0001639 0.1113506 unknown
polarizability: 80.1328753|-1.4704204|59.6476843|-0.0076522|0.0045255|24.1560474 unknown
InChI: InChI=1S/C5H4O2/c6-3-5-1-2-7-4-5/h1-4H
charge 0 multiplicity 1
11 atoms
O  -1.961696 0.508175 0.000251
O  2.644937 -0.38161 -0.000604
C  0.302935 0.204382 0.000143
C  -0.335608 -1.105254 -0.000029
C  -0.723015 1.147811 0.000188
C  -1.694648 -0.887296 0.000135
C  1.741443 0.49903 0.000165
H  0.185391 -2.059863 -0.000145
H  -0.748335 2.234603 0.000261
H  -2.573931 -1.524329 0.000164
H  2.000228 1.587351 -0.000329
