program: Gaussian 09
title: 000130440
version: EM64L-G09RevD.01
frameworkgroup: C1[X(C11H14FN5O2)]
method: RPBEPBE
basis: SDD
operation: Freq
keyword: #p
keyword: freq=noraman
keyword: PBEPBE/SDD
title: #p freq=noraman PBEPBE/SDD
converged: YES YES NO NO
title: Mulliken charges:
elementType: F O O N N N N N C C C C C C C C C C C H H H H H H H H H H H H H H
charge: -0.239945 -0.411138 -0.426690 -0.175772 -0.087315 -0.049795 -0.064496 -0.610615 -0.116123 -0.126395 -0.526422 -0.163165 -0.076651 -0.406779 0.152571 -0.237995 -0.107973 0.164257 -0.365377 0.299538 0.266695 0.254044 0.228577 0.242515 0.263056 0.215969 0.220214 0.357495 0.266798 0.342321 0.242952 0.343178 0.332463
chargesum: 0.00000
title: Mulliken charges with hydrogens summed into heavy atoms:
elementType: F O O N N N N N C C C C C C C C C C C
charge: -0.239945 -0.053643 -0.084369 -0.175772 -0.087315 -0.049795 -0.064496 0.065027 0.183415 0.140300 -0.043801 0.079350 0.186405 0.029405 0.152571 0.028803 -0.107973 0.164257 -0.122424
polarizability: 2.21404996e+02 -2.87298891e+00 1.46261737e+02 -1.32276060e+00 -1.83120234e+01 1.06020722e+02
1716.lowfreq: -2.5304 -0.0008 -0.0006 -0.0003 7.6518 13.1111 23.3343 35.5842 55.4963
frequency: 20.1380 35.4258 55.3930 64.4704 114.1374 126.1859 143.6274 191.2129 197.3053 216.1372 228.6700 249.0506 262.7141 278.6788 322.8898 335.4112 372.9335 435.4218 457.0127 467.4005 508.3514 509.6024 516.8971 543.3496 544.8741 563.5271 568.5681 627.4541 646.9655 669.0657 688.3215 704.7267 779.0217 790.9825 819.0885 839.1627 852.0115 865.3354 890.4573 928.8120 947.5569 958.7177 964.2687 977.6394 1012.9152 1036.9760 1058.0930 1077.3531 1088.2168 1109.2311 1130.3953 1144.1144 1176.0979 1191.3872 1229.0103 1236.5370 1244.5940 1253.3985 1263.9134 1282.7123 1292.8408 1304.7176 1314.7795 1316.7161 1331.0091 1332.6319 1337.3020 1361.4175 1376.7299 1378.3056 1381.2129 1403.3723 1434.9135 1467.4616 1472.3739 1477.2100 1544.6397 1578.8520 1632.2426 2966.9315 2995.1963 3014.3732 3017.8218 3034.6581 3063.1243 3085.6743 3098.2365 3164.9329 3228.8242 3539.3784 3540.9387 3564.2109 3696.2384
redmass: 6.3650 5.1413 5.2834 7.5764 3.5746 5.8643 6.4624 3.3943 6.1288 5.6064 4.2999 3.3077 4.6708 3.4606 3.0935 1.4919 3.6928 1.3551 3.2088 3.7016 1.3692 4.8511 3.7154 1.1024 3.5486 4.0547 4.0023 7.3496 4.7343 8.3992 4.6732 6.8961 3.5560 3.2287 2.1194 4.5938 8.0445 1.8272 2.3852 1.4291 2.3948 2.7897 2.3118 2.9327 3.8018 3.0947 3.6830 1.7333 2.3284 2.5544 3.5879 1.6513 1.4709 2.1879 2.0474 1.6046 1.4334 1.7300 1.2880 1.3638 2.5996 2.2372 1.9610 3.3707 1.3456 1.3389 1.6076 2.3075 1.2191 1.4548 2.2839 1.5142 3.0340 3.7315 1.0848 1.1281 7.8086 1.9082 2.7037 1.0662 1.0677 1.0849 1.0838 1.0844 1.0983 1.0986 1.0899 1.0921 1.0977 1.0651 1.0444 1.0663 1.1056
irintensity: 0.6093 0.6629 2.9641 0.0818 4.3219 1.8656 2.6060 5.7848 1.2957 1.4831 10.3919 35.0906 9.3185 3.8345 53.8972 96.4594 2.3727 160.3442 26.3467 29.1010 240.2600 33.3951 4.7007 0.5833 12.1236 1.0672 2.9122 2.3407 41.2356 6.4444 31.1734 8.2074 25.4971 17.1750 3.3892 14.5933 3.5279 2.0864 24.1185 11.6413 39.6666 15.6910 27.9618 17.1167 83.2818 20.7887 58.7882 28.1548 9.4959 18.9203 14.2125 4.8515 27.5988 17.7886 53.2582 2.1257 34.1332 1.5779 21.4675 9.7242 92.3799 13.6557 14.8624 18.4542 5.7706 1.4788 12.9423 69.1588 22.6938 12.1959 24.2039 4.8795 75.3081 32.0006 2.0847 14.7760 67.7679 39.5091 614.5037 47.8026 23.3360 8.2344 10.4698 16.1851 24.8934 18.7014 12.4228 17.6930 0.5396 26.9363 120.2679 12.4107 48.7456
temp: 298.150 k
press: 1.00000 atm
elementType: 9 8 8 7 7 7 7 7 6 6 6 6 6 6 6 6 6 6 6 1 1 1 1 1 1 1 1 1 1 1 1 1 1
symmnumber: 1
zpe: 673277.4 jmol-1
zpe.correction: 0.256438 hartree
zpe.thermalcorrener: 0.273417 hartree
zpe.thermalcorrenthalpy: 0.274361 hartree
zpe.thermalcorrgfe: 0.210550 hartree
zpe.sumelectzpe: -950.204528 hartree
zpe.sumelectthermal: -950.187550 hartree
zpe.sumelectthermalent: -950.186605 hartree
zpe.sumelectthermalfe: -950.250416 hartree
dipole: 1.8410 -2.7752 -2.3451
dipole: 4.0731
quadrupole: -102.5080 -113.1817 -113.7027
quadrupole: 5.3255 -13.2130 0.0372
quadrupole: 7.2895 -3.3843 -3.9052 5.3255 -13.2130 0.0372
hfenergy: -950.4609661 hartree
pointgroup: C01 [X(C11H14F1N5O2)]
dipole: 0.7050456 -1.0715958 -0.9605208 debye
polarizability: 221.3064406|-3.3948806|147.1590306|-3.311629|-17.2446866|105.2219834 unknown
InChI: InChI=1S/C11H14FN5O2/c12-7-5(2-18)1-6(9(7)19)17-4-16-8-10(13)14-3-15-11(8)17/h3-7,9,18-19H,1-2,13H2
charge 0 multiplicity 1
33 atoms
F  3.157447 2.07656 0.185221
O  1.321779 1.265737 2.066101
O  5.597783 -0.939938 -0.388279
N  -0.422969 -0.408264 0.048842
N  -2.08167 -1.859063 0.705107
N  -1.82888 1.471293 -0.761571
N  -4.232077 0.996286 -0.523682
N  -5.063413 -1.024318 0.376588
C  0.897846 0.178258 -0.191216
C  3.259804 -0.159252 -0.84372
C  1.799214 -0.619688 -1.172217
C  1.784039 0.309006 1.084207
C  3.170564 0.620714 0.486754
C  4.237848 -1.351568 -0.752098
C  -1.637617 0.235537 -0.21742
C  -0.754172 -1.655264 0.604238
C  -2.646739 -0.676099 0.191443
C  -3.995768 -0.245393 0.019828
C  -3.158062 1.768913 -0.87749
H  0.703178 1.19209 -0.590392
H  3.627558 0.544108 -1.614997
H  1.522687 -0.437882 -2.223095
H  1.687315 -1.705602 -0.984179
H  1.823219 -0.656811 1.622122
H  4.023886 0.465173 1.163929
H  4.227605 -1.91486 -1.70909
H  3.93807 -2.043897 0.054487
H  1.481681 2.176923 1.705314
H  -0.000838 -2.373738 0.919852
H  5.972822 -0.369198 -1.105803
H  -3.399112 2.746586 -1.305234
H  -4.907559 -1.941922 0.787991
H  -6.004968 -0.663725 0.237259
