program: Gaussian 09
title: 000130410
version: EM64L-G09RevD.01
frameworkgroup: C1[X(C21H21N5O11P2)]
method: RPBEPBE
basis: SDD
operation: Freq
keyword: #p
keyword: freq=noraman
keyword: PBEPBE/SDD
title: #p freq=noraman PBEPBE/SDD
converged: YES YES NO NO
title: Mulliken charges:
elementType: P P O O O O O O O O O O O N N N N N C C C C C C C C C C C C C C C C C C C C C H H H H H H H H H H H H H H H H H H H H H
charge: 1.480885 1.470765 -0.299107 -0.296260 -0.425029 -0.552802 -0.244531 -0.797714 -0.670928 -0.550167 -0.650855 -0.653397 -0.598952 -0.199743 -0.082394 -0.186920 -0.060431 -0.604098 -0.090193 -0.141740 -0.049538 -0.030424 -0.350024 0.226850 -0.196292 -0.097751 0.219629 0.069571 0.171468 0.214630 -0.329226 -0.435566 0.381603 -0.362525 -0.245720 -0.431495 -0.423980 -0.242592 -0.242401 0.277773 0.218693 0.315486 0.263232 0.236892 0.276524 0.399906 0.291725 0.254102 0.339793 0.349710 0.338587 0.304414 0.409151 0.247400 0.246153 0.239849 0.233630 0.233061 0.418084 0.413233
chargesum: 0.00000
title: Mulliken charges with hydrogens summed into heavy atoms:
elementType: P P O O O O O O O O O O O N N N N N C C C C C C C C C C C C C C C C C C C C C
charge: 1.480885 1.470765 -0.299107 -0.296260 -0.025123 -0.552802 -0.244531 -0.797714 -0.261778 -0.550167 -0.232771 -0.240164 -0.598952 -0.199743 -0.082394 -0.186920 -0.060431 0.084199 0.187580 0.076953 0.265948 0.232807 0.163392 0.226850 0.095433 -0.097751 0.219629 0.069571 0.171468 0.214630 -0.075124 -0.095773 0.381603 -0.058111 0.001680 -0.185343 -0.184132 -0.008962 -0.009340
polarizability: 4.23656469e+02 -3.97484112e+01 3.83710825e+02 -1.40933324e+01 -3.56257706e+01 2.74038173e+02
1716.lowfreq: -5.2188 0.0002 0.0009 0.0010 0.4579 3.9900 10.4568 15.2381 18.8100
frequency: 10.2893 15.1905 18.6543 21.6915 24.8224 33.9024 42.5488 46.2798 53.1403 59.9306 71.3955 79.8968 81.7218 96.3847 115.9667 123.4194 131.6562 135.6640 156.9909 166.9362 180.1427 184.2789 186.3573 202.5076 208.9115 209.2864 222.1040 228.8872 238.4275 244.2461 259.4120 271.4502 288.2208 297.8739 309.1903 312.9882 321.4607 333.5813 342.1043 361.9015 367.2434 379.0833 392.4726 400.5406 406.3536 426.4858 445.2981 455.1178 475.2678 484.3443 509.9068 514.4567 520.3146 530.1255 535.9800 539.1195 548.0515 554.0466 557.2406 576.9664 596.5740 621.8453 628.1550 641.5785 647.8462 661.5113 666.3459 684.4747 705.6117 715.1251 718.4604 725.2836 743.9580 758.4429 775.7143 787.6082 791.1584 791.5533 817.0208 819.2372 832.3173 839.2127 850.8022 863.4477 866.0924 875.4406 893.6060 924.4419 930.8842 936.0254 956.8563 959.4576 961.8933 964.7412 977.0737 981.7608 992.2333 998.2298 1003.4971 1009.6427 1014.2309 1033.0157 1047.9126 1055.2570 1065.4425 1083.0136 1085.8407 1091.0483 1097.5232 1102.3623 1120.3843 1138.8086 1149.5768 1154.8030 1176.9571 1185.3381 1190.7989 1193.6429 1223.1087 1235.1573 1236.1785 1243.2661 1251.1155 1274.7802 1277.9044 1278.9409 1291.0572 1298.7260 1321.6402 1331.1405 1335.3805 1352.5721 1361.4869 1373.7728 1375.2178 1385.6160 1390.2152 1403.0763 1410.8542 1436.4153 1439.2483 1451.8130 1474.7039 1478.5315 1484.9356 1515.2717 1540.9082 1576.8267 1581.7203 1588.1801 1622.1051 1632.4622 1637.3243 2908.6516 2944.3825 2980.6732 3022.2546 3031.9472 3068.7866 3110.7413 3125.9433 3129.6448 3140.7530 3154.7359 3161.4722 3171.3884 3173.9511 3190.1024 3259.6789 3365.0745 3536.0692 3578.6084 3603.5938 3690.1894
redmass: 7.0199 7.4229 7.4003 7.6972 6.9150 7.8804 8.4660 8.1678 9.3874 6.8271 6.4459 9.2243 8.1773 6.1472 5.4050 5.2850 3.0016 6.5029 6.2062 3.8665 7.1806 5.3679 5.9589 3.8936 2.6904 4.5955 5.1050 4.2606 5.0828 5.2884 3.2712 3.8169 5.5600 4.8411 6.9501 6.0505 3.8066 4.9430 6.7036 7.4895 7.7062 6.1179 4.1894 4.0478 6.4502 6.0164 4.0734 1.3962 2.6637 4.7280 3.6147 6.8914 8.7811 7.3628 6.4610 1.3749 4.9555 2.3828 1.2249 5.1448 6.1725 4.5629 5.8076 4.8172 6.2390 9.4802 9.6270 6.5297 9.7550 5.5964 5.5011 6.9270 6.1273 1.5454 9.7506 4.4188 2.4262 7.1388 8.7810 4.9706 1.5368 1.6682 3.6331 2.4635 3.3217 1.9104 1.5840 2.4719 1.4285 4.5109 2.4054 2.0305 3.3670 3.4477 1.5279 1.4733 6.1412 1.4042 1.3865 1.3405 5.6193 2.5133 4.7668 4.0681 1.4128 2.5360 2.4607 6.3781 3.6656 3.6299 2.3630 2.4738 4.5461 1.4177 1.1262 1.7951 1.2441 1.3684 2.1347 1.7363 1.5048 1.8621 1.5120 1.3511 1.8268 2.3044 1.2387 4.3125 1.5746 1.8526 1.6243 1.3441 1.2877 1.9570 2.5107 5.5477 1.6709 2.7433 6.1672 3.2073 2.3675 2.3518 3.8837 1.0939 1.2993 3.8115 8.2831 6.4835 1.8157 5.9575 7.4509 8.1320 2.8661 1.0713 1.0804 1.0851 1.0783 1.0653 1.0867 1.1099 1.0870 1.0883 1.0911 1.0917 1.0982 1.0975 1.0927 1.0952 1.0992 1.0679 1.0445 1.0661 1.0665 1.1056
irintensity: 0.2381 0.4493 0.9539 0.2783 0.5159 0.3250 0.2265 1.9594 3.9633 1.7863 0.3750 2.3811 11.4791 2.8161 7.6837 6.6697 37.4086 3.8118 6.9835 14.5490 4.0444 10.9302 3.9302 0.9780 17.6954 13.0087 11.0745 26.2125 0.6142 25.9422 51.1473 8.7380 4.2565 5.3551 5.5039 14.2273 2.0837 38.7217 146.7352 1.5892 20.5615 26.2853 15.3523 6.4113 19.9611 32.5638 16.3187 20.1872 7.0875 34.2871 24.9068 16.4565 8.7828 21.8879 36.3768 203.5088 8.3362 18.5677 16.1770 5.2333 20.0988 12.8008 18.8013 31.9945 7.2684 21.6158 90.0052 28.3853 134.2242 7.1915 40.9987 42.6144 13.3601 12.0428 360.8072 13.2925 56.7607 6.6190 430.3720 180.5891 100.1078 23.7341 3.8475 40.3243 22.9968 70.0016 5.9380 4.1118 6.6187 20.2913 28.3018 97.2717 32.8522 60.1464 59.5705 20.1792 270.6770 36.4750 38.4718 3.3009 149.6060 7.2616 41.6995 25.5406 6.7431 14.4917 55.1562 209.3327 14.7440 365.1122 193.8086 2.5417 23.3563 38.8936 24.5318 69.1216 6.0832 50.6822 26.9679 85.3232 17.7556 108.2007 57.9591 52.7895 43.7486 84.3997 4.0500 28.5706 4.5714 19.4342 42.4316 37.4622 11.0465 41.5132 2.7175 13.1639 16.6142 2.3149 7.6816 61.1812 7.2184 7.2381 43.1498 21.7672 156.9864 45.0315 44.1807 7.3228 34.1061 38.9419 59.9249 53.3628 702.6682 1161.5471 201.9496 37.1828 6.1833 24.3965 14.4132 4.6126 0.2756 5.0512 19.9279 10.4794 30.1326 8.7852 8.2877 16.7828 3.7379 954.7650 159.0035 93.1315 108.5200 53.5285
temp: 298.150 k
press: 1.00000 atm
elementType: 15 15 8 8 8 8 8 8 8 8 8 8 8 7 7 7 7 7 6 6 6 6 6 6 6 6 6 6 6 6 6 6 6 6 6 6 6 6 6 1 1 1 1 1 1 1 1 1 1 1 1 1 1 1 1 1 1 1 1 1
symmnumber: 1
zpe: 1110551.1 jmol-1
zpe.correction: 0.422987 hartree
zpe.thermalcorrener: 0.459921 hartree
zpe.thermalcorrenthalpy: 0.460866 hartree
zpe.thermalcorrgfe: 0.349400 hartree
zpe.sumelectzpe: -2593.681068 hartree
zpe.sumelectthermal: -2593.644134 hartree
zpe.sumelectthermalent: -2593.643189 hartree
zpe.sumelectthermalfe: -2593.754655 hartree
dipole: 1.7801 -0.5714 1.9656
dipole: 2.7127
quadrupole: -192.5782 -214.0712 -253.0672
quadrupole: -17.4933 -10.3052 -0.2400
quadrupole: 27.3273 5.8343 -33.1617 -17.4933 -10.3052 -0.2400
hfenergy: -2594.104055 hartree
pointgroup: C01 [X(C21H21N5O11P2)]
dipole: -0.7382753 -0.0186138 -0.770489 debye
polarizability: 427.1736315|41.1545392|359.7088399|-8.5809446|53.6889904|294.5229957 unknown
InChI: InChI=1S/C21H21N5O11P2/c22-18-15-19(24-9-23-18)26(10-25-15)20-16(27)17(14(35-20)8-34-39(32,33)37-38(29,30)31)36-21(28)13-7-3-5-11-4-1-2-6-12(11)13/h1-7,9-10,14,16-17,20,27,29-30,32H,8,22H2
charge 0 multiplicity 1
60 atoms
P  2.193051 -4.648513 0.106721
P  3.503431 -2.380778 -1.681721
O  -1.984722 -1.865501 -0.894135
O  0.654063 0.167961 -0.092262
O  -1.617382 1.371055 0.818963
O  1.170182 -3.307832 0.360864
O  1.356751 0.786457 2.039491
O  3.428669 -3.885707 -0.816624
O  1.291798 -5.542225 -1.058593
O  2.752068 -5.484358 1.321414
O  4.015929 -1.34474 -0.431063
O  4.893135 -2.743594 -2.597179
O  2.267658 -1.920332 -2.55237
N  -3.888309 -0.490168 -0.600002
N  -6.066126 -1.100944 -0.997679
N  -4.302532 1.572305 0.750527
N  -6.693797 2.0192 1.042747
N  -8.37608 0.632126 0.137076
C  -0.335626 -0.735513 0.51702
C  -1.724356 -0.045775 0.644765
C  -0.545267 -1.897236 -0.490503
C  -2.421569 -0.483238 -0.679154
C  -0.294086 -3.294338 0.077198
C  -4.684508 0.470975 0.030394
C  -4.771822 -1.404643 -1.205107
C  -6.023673 0.076481 -0.228546
C  1.477643 0.88358 0.796525
C  2.506775 1.671912 0.043653
C  -7.050194 0.904434 0.314348
C  3.346331 2.655072 0.706646
C  -5.370226 2.288755 1.218928
C  2.663095 1.430495 -1.339297
C  4.332148 3.362925 -0.0954
C  3.252309 2.981382 2.102364
C  3.640665 2.127435 -2.106801
C  4.458987 3.076775 -1.493645
C  5.173897 4.348274 0.518842
C  4.086377 3.950151 2.667567
C  5.056982 4.640279 1.877388
H  0.048621 -1.05914 1.498231
H  -2.27191 -0.541834 1.478491
H  0.09798 -1.73535 -1.375598
H  -2.085319 0.17006 -1.511789
H  -0.829925 -3.464584 1.026658
H  -0.552527 -4.071094 -0.661547
H  -2.582376 1.707484 0.926068
H  -4.401286 -2.263778 -1.756775
H  -5.13431 3.182181 1.80327
H  2.004598 0.709471 -1.833185
H  -8.658998 -0.186917 -0.397623
H  -9.068608 1.257157 0.545257
H  2.52253 2.452568 2.717811
H  1.493259 -6.511777 -1.0836
H  3.737948 1.909616 -3.174924
H  5.212697 3.619662 -2.076366
H  5.911439 4.869457 -0.10279
H  3.995386 4.182967 3.734182
H  5.702428 5.394333 2.34047
H  3.712368 -0.393157 -0.514204
H  5.554237 -3.323019 -2.136898
