program: Gaussian 09
title: 000126768
version: EM64L-G09RevD.01
frameworkgroup: C1[X(C8H9FN2O4S)]
method: RPBEPBE
basis: SDD
operation: Freq
keyword: #p
keyword: freq=noraman
keyword: PBEPBE/SDD
title: #p freq=noraman PBEPBE/SDD
converged: YES YES NO NO
title: Mulliken charges:
elementType: S F O O O O N N C C C C C C C C H H H H H H H H H
charge: 0.232654 -0.157480 -0.261695 -0.414821 -0.247553 -0.205987 -0.187735 -0.410209 0.061931 -0.729655 -0.319661 -0.306698 0.239195 -0.169911 0.172897 0.117498 0.288211 0.283824 0.286988 0.270046 0.215208 0.232124 0.290686 0.373758 0.346385
chargesum: 0.00000
title: Mulliken charges with hydrogens summed into heavy atoms:
elementType: S F O O O O N N C C C C C C C C
charge: 0.232654 -0.157480 -0.261695 -0.068436 -0.247553 -0.205987 -0.187735 -0.036450 0.350142 -0.158843 -0.049615 0.140634 0.239195 0.120774 0.172897 0.117498
polarizability: 1.86243289e+02 -1.01019528e+01 1.18930275e+02 1.11923578e+00 4.29518633e+00 9.17317944e+01
1716.lowfreq: -13.3526 -5.4103 -0.0024 -0.0016 0.0005 6.9881 18.4072 39.8166 44.9521
frequency: 17.1118 39.7851 44.7870 61.4779 108.5310 120.5035 171.4513 177.6700 226.9474 240.0124 258.8749 289.5561 305.5601 363.6880 379.5432 380.7492 445.3994 449.5231 479.2684 519.3542 548.6575 569.3367 645.7087 679.0803 683.0335 693.2199 713.6797 734.6420 753.6539 777.6840 834.6242 859.6142 872.1807 913.8634 950.0306 957.0677 993.8906 1014.1829 1077.9653 1107.0142 1132.1512 1154.4288 1188.0617 1204.9405 1207.2199 1233.4654 1258.3768 1294.6493 1321.6597 1331.3222 1338.9092 1358.1236 1374.2729 1381.5809 1418.8142 1453.1125 1456.8201 1634.8924 1651.1658 1677.3558 2954.3605 3022.0827 3040.7162 3046.3318 3089.2868 3122.4423 3195.4263 3520.0782 3554.6707
redmass: 7.8939 7.5928 5.5889 5.3993 6.8564 5.5347 7.8285 5.0760 6.0281 3.6606 5.3254 13.2733 3.1965 2.0777 12.0189 2.4987 5.9608 11.3682 5.4741 4.3091 6.6070 4.8069 4.7651 3.6931 5.8499 3.0663 9.2149 6.2523 7.8344 2.0413 2.8165 2.9900 1.4008 3.8305 1.7600 3.0156 2.9149 2.3281 3.5762 2.8402 5.4483 1.5553 1.1659 2.7456 1.6711 1.3056 1.6550 1.3956 2.4835 1.3224 1.3724 1.8281 1.7275 1.2225 2.7625 1.0794 1.0968 6.1656 12.5503 6.6538 1.0693 1.0868 1.0732 1.0705 1.0933 1.1082 1.0939 1.0771 1.0655
irintensity: 2.2772 1.7036 2.7900 0.4566 1.6544 2.1619 5.6981 4.2552 4.7673 1.5995 9.7026 2.0092 28.2056 115.7008 12.6664 41.9991 4.5578 10.9545 23.3090 0.2912 20.0871 27.2311 9.7538 12.1482 13.2718 10.4310 3.6804 2.5644 22.3223 119.0067 12.0552 27.8077 27.8665 65.1488 6.8565 75.1671 60.3021 39.2759 78.4409 21.6619 119.7339 71.6264 8.0037 17.6268 31.8232 46.2907 125.5432 44.5961 126.4169 26.9889 17.9716 27.3861 12.6410 18.4445 43.3507 8.7160 13.8452 275.5485 251.0908 490.3407 46.1723 44.7644 9.0255 17.9194 11.9424 5.0649 3.8759 75.4654 4.8376
temp: 298.150 k
press: 1.00000 atm
elementType: 16 9 8 8 8 8 7 7 6 6 6 6 6 6 6 6 1 1 1 1 1 1 1 1 1
symmnumber: 1
zpe: 461014.7 jmol-1
zpe.correction: 0.175591 hartree
zpe.thermalcorrener: 0.190703 hartree
zpe.thermalcorrenthalpy: 0.191647 hartree
zpe.thermalcorrgfe: 0.130895 hartree
zpe.sumelectzpe: -1217.339521 hartree
zpe.sumelectthermal: -1217.324410 hartree
zpe.sumelectthermalent: -1217.323466 hartree
zpe.sumelectthermalfe: -1217.384217 hartree
dipole: 2.6045 -2.2149 -0.3275
dipole: 3.4346
quadrupole: -120.9869 -112.8595 -96.3202
quadrupole: 1.6818 -6.0586 -3.0202
quadrupole: -10.9314 -2.8040 13.7353 1.6818 -6.0586 -3.0202
hfenergy: -1217.5151126 hartree
pointgroup: C01 [X(C8H9F1N2O4S1)]
dipole: -1.0151847 -0.8700144 0.1960349 debye
dipolederiv: -0.1769061 0.0261165 0.0711218 -0.0006296 -0.1497055 -0.0744148 -0.0167367 -0.0712536 -0.3414989 -0.2334213 -0.1093689 0.0297785 -0.3665305 -0.8025555 0.2476353 0.1434122 0.2746863 -0.2093553 -1.2671427 0.0389939 -0.1036101 0.1992089 -0.4273864 -0.1348326 0.1285104 -0.1634996 -0.5937802 -0.2307064 -0.1105507 0.1606598 0.0395551 -0.7595927 -0.0418485 0.1844713 -0.0072076 -0.4802998 -0.5803708 -0.1228009 0.0206103 -0.1050114 -1.1412505 0.3333687 0.0042461 0.3259978 -0.4923902 -1.339086 -0.307166 -0.0243424 -0.1447772 -0.4743793 0.0377432 -0.1123342 0.0068344 -0.3596297 -1.1675503 0.2947231 -0.2406201 -0.6789277 -0.8892951 0.1943452 -0.0220499 0.3637925 -0.3417438 -0.899943 -0.4260998 0.1034183 -0.4570597 -0.7866776 0.1169944 0.1207262 0.1213597 -0.3805214 1.4746928 0.0027132 0.1209239 0.0119321 0.3295717 0.1333076 -0.0149314 0.1465343 0.5079354 0.0772467 -0.0220285 -0.2048665 0.0925726 0.0786424 -0.0365904 -0.1936191 -0.0565009 -0.1126959 0.7466971 0.019075 0.0552177 0.087314 0.2721146 0.1386903 0.0734595 0.1573125 0.7349517 0.1953544 0.0997324 -0.1186215 0.0564518 0.4880417 -0.0524644 -0.0836735 -0.128794 0.3085199 1.2850883 0.0079407 0.1423512 0.0177526 1.5474707 -0.5445286 0.1930423 -0.5551735 0.5799525 0.4870173 0.0943048 0.0250999 0.7831096 0.4035881 -0.0544564 -0.3036262 -0.1640595 0.0169182 -0.5766209 0.0907669 -0.1326861 0.5729066 0.8238324 -0.2653317 -0.3510177 -0.3265097 0.0967563 1.8120675 0.444207 0.0477304 0.1542086 0.8556494 -0.2241976 0.1923071 -0.1748781 0.4022454 0.0826043 0.0007613 0.0129902 -0.0322737 0.0071904 -0.0136884 0.0446097 0.011131 0.0286417 -0.0726141 -0.049697 0.085258 -0.0828 -0.003833 0.0894289 0.0551772 0.0314878 0.0409627 0.0360585 0.0644098 0.0551297 0.0430022 -0.0145942 -0.0624426 0.0539185 -0.0300721 0.0764211 -0.0302513 0.0241352 0.0120662 -0.0743978 -0.0823954 0.059885 0.0418861 0.0386897 -0.1219457 0.0921676 -0.0048952 -0.0250063 0.0190198 -0.0342301 -0.0382809 0.0427178 0.0103348 -0.2014268 -0.0807684 -0.0471735 0.0031258 -0.0328186 0.0615071 0.0121232 -0.0691098 0.0134895 0.0965121 0.1015397 0.0590964 -0.0429135 0.0403329 0.0923446 0.0384108 -0.0329499 0.0416536 0.1442742 0.2111359 -0.0515673 -0.0009881 -0.0798855 0.2043893 0.0478877 0.0127132 0.0499933 0.3191245 0.053711 -0.0156284 -0.0518274 -0.062255 0.4015531 0.0932565 -0.0911496 0.0846512 0.2820722 unknown
polarizability: 185.7815223|11.5721648|118.0435387|2.6963294|-6.8495787|93.0802975 unknown
InChI: InChI=1S/C8H9FN2O4S/c9-4-1-11(8(14)10-7(4)13)5-3-16-6(2-12)15-5/h1,5-6,10,12H,2-3H2
charge 0 multiplicity 1
25 atoms
S  -3.451894 -0.818957 -1.235398
F  2.399679 2.446486 -0.970332
O  -1.733021 0.083208 0.697073
O  -3.47823 2.252375 0.171801
O  1.090127 -2.538209 0.993075
O  4.38716 0.680159 0.135514
N  0.429989 -0.5214 -0.044176
N  2.694457 -0.893786 0.534713
C  -0.971946 -0.940958 -0.056376
C  -1.592849 -1.032836 -1.472944
C  -3.15898 -0.189876 0.582093
C  -3.915819 1.094316 0.935048
C  1.387736 -1.404318 0.536467
C  0.784615 0.743564 -0.52237
C  2.078303 1.18159 -0.487564
C  3.172715 0.368411 0.060286
H  -1.017636 -1.914641 0.464581
H  -1.216541 -0.239737 -2.137669
H  -1.397107 -2.021441 -1.914742
H  -3.454831 -1.028531 1.23972
H  -3.800638 1.265458 2.027837
H  -4.987537 0.967168 0.711388
H  -0.021744 1.37261 -0.904785
H  3.404939 -1.513869 0.938609
H  -2.495048 2.328913 0.275954
